program: Gaussian 09
title: 000229113
version: EM64L-G09RevD.01
frameworkgroup: C1[X(C8H8O4)]
method: RPBEPBE
basis: SDD
operation: Freq
keyword: #p
keyword: freq=noraman
keyword: PBEPBE/SDD
title: #p freq=noraman PBEPBE/SDD
converged: YES YES NO NO
title: Mulliken charges:
elementType: O O O O C C C C C C C C H H H H H H H H
charge: -0.298738 -0.186498 -0.164410 -0.164306 -0.069697 -0.069594 -0.247473 -0.247150 -0.455444 -0.455531 0.194901 0.194592 0.238086 0.238081 0.271778 0.271608 0.217692 0.257192 0.257260 0.217652
chargesum: 0.00000
title: Mulliken charges with hydrogens summed into heavy atoms:
elementType: O O O O C C C C C C C C
charge: -0.298738 -0.186498 -0.164410 -0.164306 0.168388 0.168487 0.024305 0.024457 0.019441 0.019381 0.194901 0.194592
polarizability: 8.30166874e+01 4.90885457e-02 1.05883754e+02 3.93886395e+00 -1.29136116e-02 7.00917291e+01
1716.lowfreq: -20.5562 -19.8476 -13.8453 -0.0005 -0.0003 0.0004 34.7675 104.9495 156.4123
frequency: 34.4683 104.9006 156.4104 216.4229 266.2075 310.6330 319.2544 382.7659 427.1388 513.0663 555.4620 585.9318 586.6325 632.0116 665.6442 707.2966 728.6332 763.8211 819.4208 854.0995 874.1428 879.7916 891.5582 948.9322 999.5398 1033.3038 1039.9131 1058.2677 1110.9412 1115.6767 1144.9677 1187.7306 1202.2090 1203.3864 1238.9185 1262.4386 1278.1382 1299.2483 1332.3302 1349.8284 1365.2323 1421.7605 1456.5049 1470.6364 1693.8679 1768.6510 2993.1573 2995.8527 3009.6312 3026.8996 3055.8588 3057.7769 3110.3825 3126.2465
redmass: 7.2178 6.8228 12.0702 4.8193 2.8487 4.6278 2.7255 11.0487 3.7821 4.9122 6.9191 6.6809 12.3390 4.5992 5.8048 6.5887 3.8955 3.8770 5.3792 3.6209 2.1528 4.5120 3.3969 2.8924 2.3188 1.8997 1.4243 1.4373 1.5428 4.6336 1.4659 1.2243 1.1599 1.6149 1.3614 1.7323 1.6642 1.4549 1.3143 1.6832 1.6171 3.0785 1.0807 1.1175 12.7810 12.6892 1.0649 1.0628 1.0805 1.0834 1.0997 1.1001 1.0873 1.0955
irintensity: 0.0399 0.0035 2.2422 0.1228 12.1535 15.3275 0.7072 10.9070 1.4477 20.9899 1.7600 14.6704 1.7209 3.0704 3.4321 1.0943 9.6456 31.0528 50.8568 0.4847 4.5920 91.8861 191.9619 14.6380 31.3692 38.9785 2.6410 0.2117 23.7043 127.8531 0.8364 1.8711 4.2091 27.9590 9.9789 7.8701 0.5453 2.8345 0.9718 0.7217 14.9254 2.7544 25.7327 7.0013 462.9137 90.9164 7.5406 37.0849 13.8391 16.1147 6.3046 6.9944 10.3035 40.8493
temp: 298.150 k
press: 1.00000 atm
elementType: 8 8 8 8 6 6 6 6 6 6 6 6 1 1 1 1 1 1 1 1
symmnumber: 1
zpe: 392578.2 jmol-1
zpe.correction: 0.149525 hartree
zpe.thermalcorrener: 0.159009 hartree
zpe.thermalcorrenthalpy: 0.159953 hartree
zpe.thermalcorrgfe: 0.114135 hartree
zpe.sumelectzpe: -609.625184 hartree
zpe.sumelectthermal: -609.615700 hartree
zpe.sumelectthermalent: -609.614756 hartree
zpe.sumelectthermalfe: -609.660574 hartree
dipole: 5.8020 -0.0070 5.1910
dipole: 7.7852
quadrupole: -69.1759 -76.2960 -68.2940
quadrupole: -0.0183 -4.2023 0.0117
quadrupole: 2.0794 -5.0407 2.9613 -0.0183 -4.2023 0.0117
hfenergy: -609.7747092 hartree
pointgroup: C01 [X(C8H8O4)]
dipole: 2.1667233 -0.0036184 -2.1649256 debye
dipolederiv: -0.5307515 0.0005098 0.0812218 0.0007558 -0.3317014 -0.0002037 0.0398901 -0.0002943 -0.6055439 -0.5226958 -0.0024795 0.1572768 -0.0013229 -1.7707121 0.0002647 0.2353675 -0.0009847 -0.3137352 -0.4842157 0.1738052 0.1096137 0.174002 -1.0725965 -0.1027126 0.1498909 -0.1919764 -0.4032556 -0.4845445 -0.1732017 0.1094482 -0.175578 -1.0715237 0.1022049 0.151238 0.1939306 -0.4033394 0.2721165 0.0805556 0.0574835 -0.0268959 0.1860196 -0.0215974 0.0527964 -0.1140255 0.2874744 0.2717681 -0.0808403 0.0575293 0.026723 0.1864588 0.0215397 0.0528966 0.1142262 0.2874342 -0.1643059 -0.0162281 0.1797505 -0.0055776 -0.0104541 -0.0549855 0.2506043 -0.0519864 -0.0377325 -0.1645731 0.016624 0.18066 0.0062916 -0.0109878 0.0549799 0.2504577 0.0518346 -0.0374418 0.0888713 -0.0161426 -0.0867909 0.0510267 0.0204107 0.0153905 -0.0748015 0.0351542 0.0321281 0.0888609 0.0159091 -0.0866419 -0.0515921 0.0201734 -0.0149016 -0.0745911 -0.0350272 0.0319952 0.7759237 0.2188433 -0.3293574 -0.1423213 1.8677074 0.0850788 -0.4221043 -0.1160778 0.5708472 0.7743994 -0.2174474 -0.329814 0.1442066 1.8673516 -0.0848258 -0.4227388 0.1152781 0.5705982 -0.0596546 -0.0794291 -0.0607393 -0.0819006 0.0083229 -0.00842 -0.0951231 -0.0071334 0.0410946 -0.0592074 0.0795816 -0.0607797 0.0820095 0.0078738 0.008591 -0.0951131 0.0073477 0.0411171 0.0425898 0.0356035 -0.0501146 0.0428529 0.0368118 0.0346284 -0.0658008 0.0570624 -0.0240108 0.042586 -0.0355589 -0.0503383 -0.0426622 0.0371136 -0.0347636 -0.0660949 -0.0570954 -0.0240817 -0.0268216 -0.0125352 0.0773189 0.0032834 0.091782 -0.0055152 0.0900102 0.057432 -0.084202 0.0832763 0.0583696 -0.0165258 0.0010744 -0.07708 -0.0059319 -0.0233101 -0.0527738 0.0773826 0.0832707 -0.0588256 -0.0165233 -0.0014853 -0.0767078 0.0060139 -0.023236 0.0528884 0.0773826 -0.0268924 0.0128865 0.0773224 -0.00289 0.0917378 0.0051657 0.0897619 -0.0577792 -0.0841113 unknown
polarizability: 82.5440459|0.0057112|105.8838504|-4.6259081|-0.0156281|70.5642742 unknown
InChI: InChI=1S/C8H8O4/c9-7-3-1-5-6(11-5)2-4(3)8(10)12-7/h3-6H,1-2H2
charge 0 multiplicity 1
20 atoms
O  1.168717 -0.000918 1.374393
O  -1.854471 0.00231 0.543392
O  -1.498082 2.303778 0.430343
O  -1.501571 -2.299889 0.432912
C  2.000751 0.745171 0.342311
C  1.998692 -0.750015 0.342837
C  -0.147522 0.778032 -1.014445
C  -0.149499 -0.777848 -1.01444
C  1.20882 1.475322 -0.730147
C  1.204856 -1.478684 -0.729231
C  -1.19067 1.173974 0.045096
C  -1.194869 -1.171198 0.043857
H  2.852285 1.281018 0.778846
H  2.848738 -1.287901 0.779764
H  -0.532016 1.168123 -1.975806
H  -0.534224 -1.167013 -1.976069
H  1.816986 1.516526 -1.655217
H  1.006111 2.518186 -0.424998
H  0.99922 -2.5208 -0.423485
H  1.813146 -1.522173 -1.654118
