program: Gaussian 09
title: 000229085
version: EM64L-G09RevD.01
frameworkgroup: C1[X(C9H7N3O2S)]
method: RPBEPBE
basis: SDD
operation: Freq
keyword: #p
keyword: freq=noraman
keyword: PBEPBE/SDD
title: #p freq=noraman PBEPBE/SDD
converged: NO NO NO NO
title: Mulliken charges:
elementType: S O O N N N C C C C C C C C C H H H H H H H
charge: 0.242959 -0.198897 -0.198802 -0.021143 0.014141 0.017884 0.442731 0.034845 -0.458349 0.403147 -0.386697 -0.281103 -0.364201 -0.387614 -0.808953 0.300016 0.274509 0.294145 0.255035 0.250235 0.288162 0.287949
chargesum: 0.00000
title: Mulliken charges with hydrogens summed into heavy atoms:
elementType: S O O N N N C C C C C C C C C
charge: 0.242959 -0.198897 -0.198802 -0.021143 0.014141 0.017884 0.442731 0.034845 -0.158333 0.403147 -0.386697 -0.006594 -0.070055 -0.132579 0.017393
polarizability: 2.36460321e+02 6.44759607e+00 1.74917293e+02 1.68466900e-02 3.29157899e-03 5.72907305e+01
1716.lowfreq: -0.0021 -0.0019 -0.0017 5.2819 5.4028 12.2374 56.6609 59.3412 79.5908
frequency: 56.6028 59.3023 79.5554 104.1644 114.0671 136.8621 191.6957 202.6057 250.6999 282.7594 320.4834 396.0358 419.3638 447.5075 484.4739 515.1491 526.9419 562.2795 613.3175 641.7933 658.0582 679.0778 711.7153 747.7223 795.4332 807.0445 856.2422 866.7408 936.1031 946.2860 973.3088 983.3639 999.0419 1005.6975 1079.0526 1100.4913 1147.1235 1200.0412 1206.9610 1249.1068 1264.3814 1319.8190 1348.9201 1361.7440 1372.0425 1407.3901 1411.9721 1433.8776 1445.2549 1466.9427 1500.0866 1561.4672 1617.5811 3030.6676 3157.7010 3162.0198 3165.5822 3166.4131 3172.2833 3193.0614
redmass: 6.6512 4.5020 5.1723 1.1434 7.2983 5.3882 7.8158 4.4602 6.2431 5.6890 12.1622 10.7994 3.1974 8.0779 4.7752 8.8771 5.7204 3.9099 8.4641 6.3288 7.5472 7.7777 5.9286 9.7144 3.3020 7.9619 8.4774 1.7446 1.4996 1.4810 3.2968 1.1812 1.4431 1.3295 2.5476 2.4205 2.0410 4.5707 4.9910 2.1605 2.7194 3.6936 1.2054 2.7864 4.5513 4.3919 2.6387 1.0518 1.0619 3.4330 7.2544 8.8212 7.3846 1.0281 1.1045 1.0926 1.1058 1.0924 1.0895 1.0974
irintensity: 0.0143 0.7924 3.4226 0.0014 1.0680 3.7350 0.9226 6.4560 0.6921 2.5837 0.1688 2.6978 5.3720 2.7653 4.4511 1.5846 3.4216 0.0533 4.0306 8.2883 1.3158 38.0262 13.7941 27.4243 0.2649 25.3650 0.6805 35.0748 2.6820 30.7880 25.7046 8.6977 5.6935 0.2164 43.9169 3.4713 45.8925 212.7702 175.9584 1.2152 16.1672 238.6524 11.1638 28.9989 125.1690 21.6360 7.8825 15.9099 19.1876 58.7555 72.6407 34.0382 67.9781 15.2897 5.6185 16.8109 6.8450 3.9964 2.5299 2.1123
temp: 298.150 k
press: 1.00000 atm
elementType: 16 8 8 7 7 7 6 6 6 6 6 6 6 6 6 1 1 1 1 1 1 1
symmnumber: 1
zpe: 394250.2 jmol-1
zpe.correction: 0.150162 hartree
zpe.thermalcorrener: 0.163152 hartree
zpe.thermalcorrenthalpy: 0.164096 hartree
zpe.thermalcorrgfe: 0.109456 hartree
zpe.sumelectzpe: -1058.780462 hartree
zpe.sumelectthermal: -1058.767472 hartree
zpe.sumelectthermalent: -1058.766527 hartree
zpe.sumelectthermalfe: -1058.821168 hartree
dipole: -4.1775 1.0148 0.0013
dipole: 4.2990
quadrupole: -97.8155 -96.9465 -93.9265
quadrupole: 15.3958 0.0132 -0.0047
quadrupole: -1.5860 -0.7170 2.3030 15.3958 0.0132 -0.0047
hfenergy: -1058.9306235 hartree
pointgroup: C01 [X(C9H7N3O2S1)]
dipole: 1.686664 0.0352442 -0.1210109 debye
dipolederiv: 0.0184832 0.0074409 -0.0059836 0.4415884 -0.7684682 -0.0808047 0.0238684 -0.0489521 -0.0789095 -0.9703228 0.1890436 0.0669266 0.1124273 -0.5058684 -0.0270964 0.0624009 -0.0331682 -0.2299636 -0.6117983 -0.1045957 0.021373 -0.3066067 -0.7223418 -0.0119707 0.007623 -0.0263371 -0.2216516 -0.9613893 0.0477148 0.057302 0.1486844 -0.5226853 -0.0320774 0.0642905 -0.0247343 -0.2265594 -0.3756734 -0.6187094 -0.0265805 0.1414917 -1.161531 -0.0816532 0.0267344 -0.0264333 -0.1489411 1.9249797 0.0504205 -0.1228713 0.4613503 1.0476832 0.0246493 -0.0949 0.0550251 0.1948356 -0.4731514 0.1959792 0.0560932 0.0464774 -0.5060097 -0.04637 0.0453874 -0.0573112 0.1002131 0.6603447 0.1598964 -0.0318902 -0.0037072 0.1806963 0.008247 -0.0432093 -0.0035292 0.0695253 0.3578558 -0.0383836 -0.0354005 -0.0202739 -0.0929882 0.0011776 -0.0336683 0.0023316 -0.0863342 -0.7737319 -0.0036818 0.0612113 -0.1844788 -0.0623598 0.0046345 0.0484093 -0.0085766 0.0642241 0.2993725 0.1655836 -0.0117637 -0.650957 1.5385661 0.1566765 -0.0687501 0.0971388 -0.0060523 -0.4081671 -0.0388995 0.0182804 0.0150051 0.1942345 0.0208952 0.0218557 0.0246606 -0.1195093 0.1022788 -0.0510381 -0.0189986 0.2067166 0.0781616 -0.0017738 -0.0013345 0.016855 -0.1098841 0.7169021 0.0651663 -0.0474711 -0.2496516 0.9142657 0.0824567 -0.0695871 0.0595489 0.0099157 0.2023719 -0.1064108 -0.0187864 -0.1123214 0.118839 0.0123601 -0.0191904 0.0116833 0.0566801 0.1537075 0.0100096 0.0018417 0.0135353 0.0535608 -0.009067 0.0019451 -0.0087305 0.167992 0.0870245 -0.0314337 0.0027831 0.0081079 -0.0164143 -0.0125954 0.0055722 -0.0096907 0.1544013 0.0766225 0.0660035 0.0116026 0.014361 0.1170196 -0.0049789 0.0080269 -0.0086497 0.1716168 -0.0423012 -0.0814381 0.0062703 -0.0476536 0.0375018 -0.0025406 0.0086679 -0.0000797 0.1222837 0.0660725 0.0216833 0.0064294 0.0558427 -0.091621 -0.0186598 0.0087992 -0.0163223 0.1295483 -0.03049 0.0474987 -0.0478899 -0.0482438 0.0930617 -0.0615305 -0.0331272 -0.0469259 -0.0083227 -0.0189904 0.0481502 0.0575222 -0.0416941 0.0766974 0.0800216 0.0301863 0.0521975 -0.0051082 unknown
polarizability: 229.7778231|-18.0970206|179.9037999|-13.8226781|9.8772139|58.9867222 unknown
InChI: InChI=1S/C9H7N3O2S/c1-15-9-7-4-6(12(13)14)2-3-8(7)10-5-11-9/h2-5H,1H3
charge 0 multiplicity 1
22 atoms
S  1.680285 -2.502364 -0.438908
O  -4.383786 0.239119 0.1946
O  -3.375768 -1.800721 -0.017392
N  1.700816 2.120057 -0.115619
N  2.838715 -0.028932 -0.349607
N  -3.340623 -0.512272 0.066946
C  0.400184 0.001447 -0.170194
C  0.481752 1.445241 -0.074622
C  -0.869591 -0.636668 -0.12228
C  -2.011521 0.156406 0.016455
C  1.667461 -0.692145 -0.311045
C  -0.719285 2.208749 0.066143
C  -1.961882 1.577724 0.112243
C  2.794655 1.350516 -0.249202
C  3.526828 -2.821336 -0.594082
H  -0.975692 -1.723673 -0.190268
H  -0.622218 3.295761 0.135009
H  -2.894664 2.136564 0.219075
H  3.764456 1.856708 -0.284018
H  3.625243 -3.914866 -0.672366
H  4.041013 -2.436979 0.296761
H  3.910821 -2.320436 -1.492629
