program: Gaussian 09
title: 000229098
version: EM64L-G09RevD.01
frameworkgroup: C1[X(C16H34N2)]
method: RPBEPBE
basis: SDD
operation: Freq
keyword: #pfreq=noraman
keyword: PBEPBE/SDD
title: #p freq=noraman PBEPBE/SDD
converged: YES YES NO NO
title: Mulliken charges:
elementType: N N C C C C C C C C C C C C C C C C H H H H H H H H H H H H H H H H H H H H H H H H H H H H H H H H H H
charge: -0.372194 -0.087458 -0.140432 -0.428698 -0.386636 -0.324108 0.145224 -0.357736 -0.701915 -0.415338 -0.339354 -0.430484 -0.698358 -0.351043 -0.350177 -0.327998 -0.687471 -0.697063 0.205500 0.171985 0.199426 0.203861 0.184401 0.209808 0.183642 0.192003 0.192705 0.284575 0.211699 0.208094 0.242925 0.244439 0.192062 0.186294 0.226512 0.208516 0.159623 0.212660 0.211175 0.214804 0.200110 0.174096 0.197965 0.186700 0.176283 0.212970 0.210665 0.212241 0.208577 0.210429 0.203384 0.211110
chargesum: 0.00000
title: Mulliken charges with hydrogens summed into heavy atoms:
elementType: N N C C C C C C C C C C C C C C C C
charge: -0.087619 -0.087458 0.065067 -0.057287 0.001625 0.069342 0.145224 0.026972 -0.039197 0.021164 0.073451 -0.062344 -0.059720 0.023163 0.034488 0.061256 -0.055988 -0.072140
polarizability: 1.96285376e+02 5.46101441e-01 1.96825233e+02 -5.36582518e-01 3.30723443e+00 1.76674017e+02
1716.lowfreq: -12.7650 -11.6931 -4.7260 -0.0005 -0.0005 0.0005 10.0551 17.6017 23.1444
frequency: -10.6339 17.4577 22.2548 26.6677 52.7288 59.3202 62.0282 71.3088 77.0806 80.3672 98.0832 116.6837 131.1251 155.1709 174.8573 189.6035 212.7931 227.8178 232.0473 233.5952 236.9871 243.6996 249.8476 265.3344 294.4912 303.1780 318.8835 376.1908 388.7244 427.5023 446.1585 497.1604 505.2135 562.3563 584.7154 683.2074 699.9917 728.4958 739.4314 749.2384 778.8561 807.9964 816.3065 823.7437 849.8202 863.5085 883.9927 912.0676 924.3164 932.7266 948.9602 965.7664 984.1692 998.4452 1027.1069 1035.0399 1042.8956 1050.2034 1065.5614 1077.7576 1079.6636 1084.0985 1106.4138 1112.5374 1114.1180 1125.0445 1140.2426 1143.7399 1150.5083 1207.0004 1217.0392 1227.9456 1234.9975 1239.9499 1252.6845 1263.4359 1267.5263 1282.8756 1285.0594 1286.1260 1289.7412 1294.6905 1298.0994 1313.2712 1326.2221 1330.9806 1332.3079 1343.8132 1352.7039 1354.5456 1360.7530 1368.4786 1386.2780 1388.1624 1388.7639 1389.8874 1439.9122 1449.3035 1455.9474 1458.0186 1461.1318 1465.0423 1470.0465 1472.6351 1473.3919 1474.3016 1475.6636 1477.2345 1477.4375 1479.2231 1484.9716 1484.9766 1485.6555 1487.4963 1492.5882 1626.5503 2886.6514 2946.4119 2953.1359 2955.7470 2956.2652 2958.7604 2962.9773 2965.9623 2968.1751 2970.2572 2970.5615 2972.4992 2973.7992 2976.7830 2987.0753 2987.9077 2996.5089 3001.2001 3003.6879 3011.2391 3020.2285 3034.6043 3038.6268 3042.7956 3061.4373 3064.9176 3065.9237 3066.9712 3067.8518 3069.1377 3070.4150 3070.5958 3079.0735 3589.5505
redmass: 3.1590 3.5227 3.3804 3.5263 2.7200 1.5209 3.2970 2.4949 1.7298 1.8577 2.8495 2.4123 2.5358 2.7401 2.0188 2.5779 2.9985 1.9543 1.2516 1.1336 1.3268 1.3256 2.0902 1.9926 3.5624 2.7273 3.0686 2.3448 1.3571 2.6215 2.2143 2.7517 2.6371 3.7222 2.3604 3.7931 2.0279 1.1113 1.1553 1.2672 1.2378 1.2797 2.0232 1.7880 1.5599 1.5635 1.8620 1.4736 1.4168 1.4811 1.3050 1.8680 2.6450 2.5282 1.5015 2.4875 2.7285 2.9616 1.9494 2.1062 2.6164 1.9740 2.3160 2.0261 2.0392 1.8024 2.5823 2.0873 2.5826 1.5409 1.3416 1.3702 1.3573 1.3101 1.2829 1.3161 1.3912 1.2672 1.1270 1.1111 1.3152 1.1039 1.2963 1.2364 1.4552 1.4396 1.4471 1.4840 1.5075 1.5500 1.3331 1.3255 1.2146 1.2140 1.2135 1.2151 1.1152 1.0818 1.0915 1.0806 1.0795 1.0741 1.0713 1.0653 1.0630 1.0455 1.0461 1.0457 1.0475 1.0790 1.0707 1.0956 1.0751 1.1121 1.5574 6.9820 1.0615 1.0608 1.0857 1.0588 1.0597 1.0617 1.0597 1.0601 1.0376 1.0366 1.0384 1.0605 1.0664 1.0375 1.0630 1.0904 1.0918 1.0974 1.0999 1.0943 1.0982 1.1027 1.1022 1.0990 1.1014 1.1001 1.1005 1.0999 1.1005 1.0996 1.0996 1.0995 1.1001 1.0771
irintensity: 0.2155 0.1881 0.0974 0.0386 0.3596 0.0598 0.2488 0.2995 0.4416 0.3417 0.1201 0.5517 1.5099 1.0586 0.3453 1.6756 2.9634 1.5804 0.9571 0.2709 0.1191 0.2746 4.1027 2.2703 0.9328 1.8961 0.6012 16.9173 90.5066 6.3158 21.9589 1.3299 5.2087 10.3011 0.9099 2.0803 0.5591 9.9809 18.3870 3.4912 3.9227 4.5710 2.0663 0.9782 2.1532 2.0435 3.8815 3.5729 7.3692 10.6400 3.8564 3.5428 1.5030 0.6104 1.6514 3.9898 2.9764 2.1509 2.3189 3.2812 2.0589 6.8027 2.7483 7.6047 3.7384 2.3065 2.9618 10.7513 8.2877 6.9470 0.7124 4.3555 7.6367 10.5210 2.2722 2.6220 17.3151 0.9539 2.1300 1.2937 7.8221 1.7526 1.0773 20.6076 1.7222 4.0406 16.6353 8.6973 1.0194 4.0511 5.8821 6.8695 10.7946 1.6169 10.0007 23.2223 20.7045 11.9687 7.5016 0.5721 5.1650 1.8091 2.7587 3.8938 4.9090 9.7244 19.7682 15.4024 0.4528 6.8650 16.6715 17.2431 14.3719 13.2957 130.0241 266.7613 82.8352 11.3760 24.6374 26.3395 0.2562 52.1424 23.7924 113.9052 29.5548 45.1511 17.6095 54.4164 92.5968 43.2526 66.2190 8.9519 6.9095 15.9020 0.7867 8.0170 18.4321 77.6362 54.3546 36.3295 9.8476 50.7221 153.6381 85.8036 46.8239 32.0471 41.9243 86.1780 53.6504 15.6633
temp: 298.150 k
press: 1.00000 atm
elementType: 7 7 6 6 6 6 6 6 6 6 6 6 6 6 6 6 6 6 1 1 1 1 1 1 1 1 1 1 1 1 1 1 1 1 1 1 1 1 1 1 1 1 1 1 1 1 1 1 1 1 1 1
symmnumber: 1
zpe: 1244176.1 jmol-1
zpe.correction: 0.473882 hartree
zpe.thermalcorrener: 0.497534 hartree
zpe.thermalcorrenthalpy: 0.498478 hartree
zpe.thermalcorrgfe: 0.418403 hartree
zpe.sumelectzpe: -738.088755 hartree
zpe.sumelectthermal: -738.065103 hartree
zpe.sumelectthermalent: -738.064159 hartree
zpe.sumelectthermalfe: -738.144234 hartree
dipole: -0.6667 -2.1804 0.7677
dipole: 2.4058
quadrupole: -117.0816 -115.7908 -114.6355
quadrupole: 0.7128 -2.8910 3.1734
quadrupole: -1.2457 0.0451 1.2005 0.7128 -2.8910 3.1734
hfenergy: -738.5626372 hartree
pointgroup: C01 [X(C16H34N2)]
dipole: -0.6197831 0.6609085 0.2738152 debye
polarizability: 196.7633343|-0.4989613|196.0353452|1.0325611|-4.0345706|176.9859463 unknown
InChI: InChI=1S/C16H34N2/c1-5-9-12-15(8-4)16(17-13-10-6-2)18-14-11-7-3/h15,17H,5-14H2,1-4H3
charge 0 multiplicity 1
52 atoms
N  -0.711687 0.954423 -1.573946
N  1.406444 0.225727 -0.946544
C  0.270144 2.128856 0.355894
C  -0.935579 1.871197 1.307344
C  0.206659 3.556054 -0.263079
C  -0.91012 0.486949 1.992741
C  0.398616 1.040505 -0.730073
C  -2.12301 0.248144 2.919862
C  1.425216 3.899816 -1.145069
C  -0.823904 -0.044932 -2.646451
C  -1.278617 -1.442904 -2.156669
C  2.651973 0.251451 -0.163425
C  -2.104328 -1.146549 3.581985
C  3.228313 -1.178699 -0.043751
C  -2.698979 -1.466322 -1.550444
C  2.330932 -2.122971 0.784911
C  -3.111342 -2.868275 -1.050897
C  2.903394 -3.551898 0.896637
H  1.18846 2.083973 0.972553
H  -1.892628 1.985865 0.753819
H  -0.939575 2.665735 2.082185
H  0.127745 4.287856 0.566444
H  -0.722236 3.664083 -0.860466
H  -0.880118 -0.306116 1.218358
H  0.027447 0.382891 2.5782
H  -3.057555 0.365527 2.332841
H  -2.148243 1.032892 3.703797
H  -1.520513 1.533998 -1.358357
H  1.347919 4.9258 -1.549085
H  2.365694 3.833469 -0.566096
H  1.505055 3.201403 -1.997619
H  0.171772 -0.138472 -3.115501
H  -1.535513 0.340877 -3.403369
H  -1.233346 -2.143697 -3.01636
H  -0.54103 -1.802076 -1.413548
H  3.397285 0.889102 -0.687191
H  2.540926 0.669393 0.865597
H  -2.111916 -1.94591 2.816545
H  -1.194254 -1.281621 4.196542
H  -2.98137 -1.297448 4.237967
H  3.352451 -1.591729 -1.064121
H  4.23736 -1.12356 0.416112
H  -2.747133 -0.749048 -0.7053
H  -3.429935 -1.112405 -2.30771
H  2.191315 -1.696656 1.80097
H  1.328249 -2.15295 0.314948
H  -2.413505 -3.228613 -0.271274
H  -4.129631 -2.864434 -0.619677
H  -3.096122 -3.604084 -1.87716
H  3.022979 -4.007518 -0.104684
H  3.898604 -3.54605 1.381517
H  2.242234 -4.21015 1.490696
