program: Gaussian 09
title: 000229096
version: EM64L-G09RevD.01
frameworkgroup: C1[X(C16H15Cl2NO)]
method: RPBEPBE
basis: SDD
operation: Freq
keyword: #p
keyword: freq=noraman
keyword: PBEPBE/SDD
title: #p freq=noraman PBEPBE/SDD
converged: YES YES NO NO
title: Mulliken charges:
elementType: Cl Cl O N C C C C C C C C C C C C C C C C H H H H H H H H H H H H H H H
charge: -0.060797 -0.060385 -0.284019 -0.367430 -0.562175 0.507313 0.534190 0.259863 -0.417010 -0.440396 -0.365887 -0.325900 -0.344006 -0.211147 -0.206467 -0.224655 -0.219816 -0.110552 -0.112110 -0.653549 0.196633 0.228917 0.225967 0.292421 0.261576 0.298110 0.218955 0.260164 0.254002 0.254064 0.254802 0.254559 0.239161 0.202723 0.222881
chargesum: 0.00000
title: Mulliken charges with hydrogens summed into heavy atoms:
elementType: Cl Cl O N C C C C C C C C C C C C C C C C
charge: -0.060797 -0.060385 -0.284019 -0.069319 -0.365542 0.507313 0.534190 0.259863 -0.188093 -0.214429 -0.073467 -0.064324 0.135113 0.042855 0.047598 0.030147 0.034744 -0.110552 -0.112110 0.011215
polarizability: 2.45293079e+02 2.46639164e+00 1.89487884e+02 -1.00596921e+01 6.26229485e+00 1.70220117e+02
1716.lowfreq: -3.0846 -2.1107 -0.0019 -0.0013 0.0014 7.9984 14.9183 22.9040 27.1594
frequency: 14.8029 22.7576 27.1511 33.7268 41.1884 71.6820 89.1840 105.5035 133.5991 152.9796 194.3288 198.5960 222.1510 254.7839 290.2890 309.6377 330.8812 336.2739 347.6848 379.0589 407.3729 409.3514 418.8630 450.3771 494.4929 518.0063 571.5705 614.8854 622.1791 627.2519 660.5112 698.4168 724.5073 726.2106 733.6904 790.0224 807.2728 820.1025 823.7186 834.2355 855.3411 864.6074 897.2064 932.4077 945.5506 955.2950 957.8661 989.6837 998.7139 1000.3651 1066.0264 1072.8427 1074.6172 1099.0759 1105.7507 1113.8194 1142.3905 1174.8580 1185.0178 1190.5446 1190.8111 1205.1354 1238.3257 1279.9529 1291.1392 1302.0124 1317.3100 1355.3905 1377.1056 1380.5870 1390.5453 1397.3894 1401.1891 1467.4866 1472.3127 1473.1325 1475.6423 1481.5278 1493.6042 1584.1302 1587.1647 1594.0652 1598.7652 1616.0248 2983.4751 2994.9868 2996.8260 3067.7802 3087.2343 3099.2205 3122.2125 3124.7022 3147.5242 3159.9334 3167.9788 3169.1286 3171.0762 3179.4951 3548.9459
redmass: 3.8407 6.0491 4.9806 2.9674 4.4370 6.7483 4.6286 4.8434 7.8475 7.7779 3.9328 2.1221 6.4451 2.4472 6.3053 3.4917 5.4160 4.3708 6.0485 7.7909 2.8845 2.9345 4.0916 4.3711 3.0487 3.2416 1.2778 5.5010 6.9233 6.7037 4.7632 4.5592 4.2722 5.2542 2.5484 1.7405 1.7820 1.4501 1.6413 1.4467 1.8509 3.3261 2.2766 2.0438 1.4940 1.6706 1.3980 1.3566 4.4397 4.2818 3.5939 2.6359 2.6930 1.9960 1.4034 1.3729 1.6940 2.3548 1.1351 1.2779 1.7636 2.2778 1.6796 1.1509 1.3888 1.3214 1.6773 1.3374 5.9155 6.7326 1.2178 2.4355 2.4418 1.1485 1.7473 1.2468 2.0787 1.0974 1.7022 7.5447 7.4363 6.2257 6.0910 5.8840 1.0362 1.0810 1.0688 1.0979 1.0973 1.1017 1.0898 1.0898 1.0898 1.0887 1.0952 1.0951 1.0964 1.0969 1.0774
irintensity: 1.7749 0.2738 0.0465 1.4436 0.1714 2.3320 4.7878 0.9624 0.6600 5.1511 1.2458 0.8373 0.3952 3.0256 0.1368 6.7497 0.0651 0.6635 12.8920 25.1817 0.2877 0.2558 3.1073 1.0783 28.7912 52.7326 81.2793 23.3318 1.1448 4.6809 1.0086 3.2357 3.0928 4.8182 13.7259 75.2582 32.9504 7.2139 17.8676 2.5750 17.9326 1.4287 1.3679 8.9335 1.0709 2.0043 0.3513 0.2734 70.4686 28.8219 12.1492 49.8307 16.3795 6.7871 1.7569 22.2328 15.3992 41.0866 3.7590 1.2297 1.5082 92.8747 4.1652 41.2027 29.8791 2.9219 29.3840 3.6989 2.3558 2.7895 18.0067 1.5098 10.9074 100.8849 141.1237 22.1108 75.5163 13.2634 133.1217 3.9947 2.2540 6.7649 13.2575 113.0195 28.1933 41.2503 32.5377 11.9378 31.9494 31.4107 9.7571 13.9344 2.2406 1.9133 3.7800 5.8451 3.4423 0.8678 18.0969
temp: 298.150 k
press: 1.00000 atm
elementType: 17 17 8 7 6 6 6 6 6 6 6 6 6 6 6 6 6 6 6 6 1 1 1 1 1 1 1 1 1 1 1 1 1 1 1
symmnumber: 1
zpe: 705333.5 jmol-1
zpe.correction: 0.268647 hartree
zpe.thermalcorrener: 0.287938 hartree
zpe.thermalcorrenthalpy: 0.288882 hartree
zpe.thermalcorrgfe: 0.216463 hartree
zpe.sumelectzpe: -1667.383289 hartree
zpe.sumelectthermal: -1667.363998 hartree
zpe.sumelectthermalent: -1667.363054 hartree
zpe.sumelectthermalfe: -1667.435474 hartree
dipole: -0.6625 4.1976 3.6798
dipole: 5.6214
quadrupole: -151.3041 -124.2770 -120.4142
quadrupole: -4.4730 -3.4700 6.6479
quadrupole: -19.3057 7.7214 11.5843 -4.4730 -3.4700 6.6479
hfenergy: -1667.6519361 hartree
pointgroup: C01 [X(C16H15Cl2N1O1)]
dipole: -0.0525816 -1.6636504 1.456271 debye
polarizability: 243.348378|-13.2546767|192.3316591|0.6983834|-7.4286793|169.3210425 unknown
InChI: InChI=1S/C16H15Cl2NO/c1-2-19-16(20)15(11-3-7-13(17)8-4-11)12-5-9-14(18)10-6-12/h3-10,15,19H,2H2,1H3
charge 0 multiplicity 1
35 atoms
Cl -4.888954 3.505005 0.211825
Cl 5.180966 2.109918 -0.914772
O  -0.506117 -1.797197 -1.582592
N  -0.526226 -2.987804 0.415653
C  -0.21606 -0.536498 0.529312
C  -1.404416 0.435906 0.414625
C  1.120855 0.124696 0.154479
C  -0.429161 -1.81857 -0.314698
C  -1.753533 1.214435 1.547783
C  2.157635 0.211112 1.115638
C  -2.138542 0.614362 -0.785692
C  1.34439 0.653246 -1.142495
C  -0.6969 -4.3104 -0.215287
C  -2.808528 2.151798 1.49763
C  3.397771 0.814077 0.802987
C  -3.200216 1.544525 -0.851792
C  2.577153 1.255022 -1.473589
C  -3.518099 2.30101 0.291209
C  3.585624 1.327869 -0.492775
C  0.533432 -5.220126 -0.021348
H  -0.139739 -0.830749 1.594171
H  -1.192738 1.099062 2.483397
H  2.004601 -0.191734 2.124514
H  -1.889031 0.01108 -1.664339
H  0.561558 0.57695 -1.902146
H  -0.443944 -2.94507 1.432959
H  -1.604347 -4.793718 0.195607
H  -0.871022 -4.11681 -1.287103
H  -3.071199 2.749701 2.375043
H  4.194624 0.881149 1.54916
H  -3.767589 1.675585 -1.777815
H  2.749853 1.659019 -2.475207
H  1.432393 -4.756592 -0.463007
H  0.732817 -5.415643 1.04902
H  0.366489 -6.194117 -0.516055
