program: Gaussian 09
title: 000229099
version: EM64L-G09RevD.01
frameworkgroup: C1[X(C16H34N2)]
method: RPBEPBE
basis: SDD
operation: Freq
keyword: #pfreq=noraman
keyword: PBEPBE/SDD
title: #p freq=noraman PBEPBE/SDD
converged: YES YES NO NO
title: Mulliken charges:
elementType: N N C C C C C C C C C C C C C C C C H H H H H H H H H H H H H H H H H H H H H H H H H H H H H H H H H H
charge: -0.169525 -0.066925 -0.075849 -0.427688 0.116865 -0.406184 -0.343585 -0.356899 -0.721572 -0.317107 -0.354863 -0.424751 -0.370321 -0.702157 -0.712585 -0.680055 -0.345106 -0.693815 0.187912 0.224109 0.182906 0.194353 0.229595 0.173158 0.202125 0.199711 0.191667 0.203952 0.230072 0.211812 0.226749 0.197782 0.228209 0.215131 0.198631 0.183984 0.174558 0.201988 0.215371 0.208906 0.208056 0.217759 0.218066 0.235310 0.219335 0.224654 0.216498 0.224920 0.178824 0.210767 0.212051 0.203204
chargesum: 0.00000
title: Mulliken charges with hydrogens summed into heavy atoms:
elementType: N N C C C C C C C C C C C C C C C C
charge: -0.169525 -0.066925 0.112063 -0.020674 0.116865 0.017764 0.031698 0.034480 -0.080451 0.116917 0.083698 -0.042136 0.006225 -0.069824 -0.041450 -0.019568 0.058638 -0.067793
polarizability: 2.06018487e+02 8.64017897e+00 1.91254238e+02 -6.74082972e-02 -2.83835185e-01 1.80023121e+02
1716.lowfreq: -13.5374 -9.0847 -0.0002 0.0002 0.0004 6.8637 19.9942 23.8724 35.2262
frequency: 19.1333 23.1503 34.6087 52.4515 55.0776 61.4613 67.3007 69.6490 78.7162 88.7084 112.9070 120.7434 143.4233 152.4400 171.0343 183.7459 210.2942 221.1013 225.8764 236.8588 241.2092 257.8803 271.6070 282.4725 295.7596 299.0183 321.2419 325.4229 355.1141 427.7217 443.2422 457.9573 500.1193 531.0719 582.6015 675.0565 694.1319 730.3882 742.0210 775.0605 778.4599 796.6933 805.8252 831.1451 842.5931 867.3965 892.0098 915.6409 920.7088 929.9479 955.6617 964.8665 984.4462 1009.2651 1028.9743 1039.1366 1048.6541 1057.1106 1070.5122 1072.2724 1080.7398 1083.1325 1100.3413 1108.9972 1113.4136 1114.4935 1125.5630 1134.2804 1152.5426 1204.3363 1210.6180 1220.7372 1234.4154 1238.2709 1242.6773 1259.9552 1271.2187 1283.3900 1287.5872 1289.5566 1291.9556 1302.2179 1323.2015 1328.2080 1333.5483 1336.4150 1347.6737 1352.0658 1357.4705 1362.0553 1383.0024 1384.2167 1385.6121 1387.0469 1388.0847 1388.5142 1445.7784 1449.3804 1449.7789 1459.5708 1463.8330 1464.9760 1466.1583 1472.3113 1473.8231 1474.6394 1476.3762 1477.0574 1479.6019 1481.3350 1483.0136 1484.7865 1486.1929 1487.6293 1496.9079 1598.9189 2895.5480 2946.8569 2950.4678 2957.9995 2958.3070 2961.8439 2965.3680 2965.9262 2966.3307 2968.6006 2969.1759 2975.0224 2975.7072 2981.1277 2983.2077 2985.5850 2996.5364 3016.6232 3019.5536 3032.4494 3039.9776 3043.5178 3061.8134 3064.9773 3065.2898 3066.1128 3066.3872 3067.3983 3067.7575 3068.3292 3080.7746 3081.4451 3090.7141 3094.5901
redmass: 2.9000 3.6190 2.9598 3.0386 3.1684 1.5975 2.0984 2.3260 2.2537 2.6490 2.5351 2.5010 2.5270 1.8590 1.9817 2.0368 1.9915 1.4187 1.2498 1.5173 1.4206 1.5976 1.5507 1.7768 3.3668 2.7899 2.6370 2.0937 2.6620 2.8354 3.1139 2.9781 3.0596 2.7934 2.4986 2.4969 3.4289 1.1273 1.1912 1.2695 1.1455 1.2635 1.3558 1.9241 1.6238 1.9880 1.9194 1.4892 1.5425 1.7788 1.3453 2.0392 3.7405 2.6377 1.5311 2.3185 2.8683 2.6279 1.9506 2.0187 2.1591 2.0311 2.1508 1.8607 1.9854 1.8743 1.8652 2.0817 2.6419 2.9366 1.5365 1.4064 1.3313 1.4542 1.4767 1.2169 1.2625 1.1923 1.1191 1.1635 1.1019 1.2949 1.4084 1.3740 1.3553 1.3209 1.3312 1.5582 1.5508 1.3624 1.6364 1.2206 1.2185 1.2180 1.2170 1.2195 1.0888 1.0816 1.0841 1.0708 1.0786 1.0624 1.0549 1.0590 1.0521 1.0501 1.0561 1.0429 1.0608 1.0495 1.0469 1.0739 1.0775 1.0580 1.0737 8.1865 1.0594 1.0701 1.0600 1.0656 1.0794 1.0631 1.0500 1.0561 1.0578 1.0381 1.0376 1.0691 1.0660 1.0362 1.0375 1.0796 1.0942 1.0935 1.1003 1.0985 1.1020 1.1015 1.0998 1.0982 1.0968 1.0996 1.0979 1.0967 1.1003 1.0991 1.0972 1.0976 1.0987 1.0984
irintensity: 0.3756 0.0748 0.0966 0.2544 0.5080 0.0453 0.2249 0.2147 0.0883 0.1726 0.0986 0.3168 0.6699 3.8420 0.5147 0.0751 0.0549 0.2428 0.5823 0.4737 0.5463 2.4767 2.1611 1.9005 0.5681 5.4704 2.4932 0.5262 0.2300 2.8423 8.0485 1.4003 11.6115 1.5426 3.3322 2.1072 2.5104 9.9794 5.5129 4.1820 6.5302 8.2555 3.5469 3.3987 8.5209 0.6912 10.3546 4.2125 4.0311 5.8039 3.5745 3.7585 2.1843 5.0361 5.8581 7.3822 6.3870 12.0011 8.7821 41.8650 5.1781 8.6165 23.5988 12.5426 5.9906 6.1831 2.6511 11.3085 19.2767 26.9045 2.9807 2.8862 10.8917 27.5396 57.8235 4.2246 3.4564 8.4745 0.5423 8.3246 0.3341 0.9088 2.7518 2.7921 1.4965 25.3637 8.0828 2.5790 0.8606 3.3963 45.3494 25.4351 7.0110 2.4324 13.9364 16.6091 41.0923 1.3700 0.6512 13.5340 5.2444 2.9968 5.9137 4.9055 2.1883 12.5090 12.8456 11.1884 7.2199 6.5078 19.3903 7.4838 15.6624 8.4152 0.3607 228.4681 48.0342 65.1126 10.4244 18.8244 18.8204 31.3687 30.4111 37.0934 89.8215 40.6040 25.6619 99.0037 77.4350 31.6417 27.2283 32.2102 13.0841 7.8120 11.2923 2.2522 28.1682 29.4603 61.1508 46.4597 54.7993 74.1999 25.8942 48.1553 68.3661 64.8862 73.0923 16.8743 36.6906 42.8757
temp: 298.150 k
press: 1.00000 atm
elementType: 7 7 6 6 6 6 6 6 6 6 6 6 6 6 6 6 6 6 1 1 1 1 1 1 1 1 1 1 1 1 1 1 1 1 1 1 1 1 1 1 1 1 1 1 1 1 1 1 1 1 1 1
symmnumber: 1
zpe: 1242681.0 jmol-1
zpe.correction: 0.473312 hartree
zpe.thermalcorrener: 0.497783 hartree
zpe.thermalcorrenthalpy: 0.498728 hartree
zpe.thermalcorrgfe: 0.417061 hartree
zpe.sumelectzpe: -738.067776 hartree
zpe.sumelectthermal: -738.043305 hartree
zpe.sumelectthermalent: -738.042361 hartree
zpe.sumelectthermalfe: -738.124027 hartree
dipole: 0.8977 2.5315 0.1417
dipole: 2.6897
quadrupole: -119.7287 -114.5644 -113.1778
quadrupole: -0.6026 0.7410 -0.9113
quadrupole: -3.9051 1.2593 2.6458 -0.6026 0.7410 -0.9113
hfenergy: -738.5410883 hartree
pointgroup: C01 [X(C16H34N2)]
dipole: -0.2641348 1.0242532 0.0313043 debye
polarizability: 204.393499|-9.7691193|192.7422063|-0.7720263|1.3416357|180.1601411 unknown
InChI: InChI=1S/C16H34N2/c1-6-11-13-15(8-3)16(17-14-12-7-2)18(9-4)10-5/h15H,6-14H2,1-5H3
charge 0 multiplicity 1
52 atoms
N  -0.113548 1.50475 0.140272
N  0.710891 -0.76248 0.559572
C  -0.612363 -0.417979 -1.442629
C  -1.752205 -1.397569 -1.029685
C  0.076552 0.125966 -0.169653
C  0.395267 -1.134272 -2.380609
C  -2.867512 -0.76139 -0.172554
C  -4.018968 -1.744286 0.140108
C  1.463797 -0.202533 -2.989804
C  -0.376453 1.949623 1.529005
C  -0.05026 2.553776 -0.901331
C  1.556661 -0.419363 1.718942
C  2.771407 -1.374469 1.772308
C  -5.124682 -1.119713 1.018119
C  -1.677227 2.774095 1.665111
C  1.109992 3.552501 -0.678234
C  3.743543 -1.185878 0.587895
C  4.950879 -2.146058 0.645449
H  -1.084113 0.422707 -1.990103
H  -1.290497 -2.236454 -0.473809
H  -2.200708 -1.817168 -1.954748
H  -0.168634 -1.631071 -3.196084
H  0.889292 -1.928781 -1.789565
H  -3.27851 0.130081 -0.693313
H  -2.435214 -0.397618 0.781745
H  -3.602577 -2.638747 0.646701
H  -4.460238 -2.104471 -0.812039
H  0.47264 2.536748 1.939707
H  -0.469879 1.046033 2.152279
H  -1.007909 3.111082 -0.959437
H  0.095322 2.063417 -1.87658
H  1.004787 0.589251 -3.614046
H  2.06014 0.287341 -2.196863
H  2.16449 -0.76732 -3.632169
H  0.981901 -0.540379 2.662841
H  1.920441 0.634771 1.689363
H  3.313192 -1.212904 2.72783
H  2.395748 -2.416523 1.778129
H  -5.936044 -1.841893 1.225013
H  -4.715705 -0.783874 1.990101
H  -5.575063 -0.238661 0.5222
H  -1.617488 3.744384 1.139861
H  -1.868287 2.987546 2.733195
H  -2.539258 2.213523 1.261856
H  0.992184 4.113633 0.266331
H  2.078699 3.022155 -0.646067
H  1.141407 4.287889 -1.503626
H  3.182308 -1.339737 -0.353997
H  4.103894 -0.135512 0.575643
H  4.616049 -3.200602 0.629446
H  5.632473 -1.994936 -0.212218
H  5.535785 -1.995431 1.573141
