program: Gaussian 09
title: 000229036
version: EM64L-G09RevD.01
frameworkgroup: C1[X(C7H8N2OS4)]
method: RPBEPBE
basis: SDD
operation: Freq
keyword: #p
keyword: freq=noraman
keyword: PBEPBE/SDD
title: #p freq=noraman PBEPBE/SDD
converged: YES YES NO NO
title: Mulliken charges:
elementType: S S S S O N N C C C C C C C H H H H H H H H
charge: 0.239143 0.239166 0.289531 0.289555 -0.073582 0.118753 0.118806 -0.680699 -0.680708 -0.398231 -0.398236 -0.476978 -0.477053 -0.218351 0.270563 0.284986 0.284984 0.270568 0.246970 0.251916 0.251923 0.246973
chargesum: 0.00000
title: Mulliken charges with hydrogens summed into heavy atoms:
elementType: S S S S O N N C C C C C C C
charge: 0.239143 0.239166 0.289531 0.289555 -0.073582 0.118753 0.118806 -0.125150 -0.125155 0.100655 0.100661 -0.476978 -0.477053 -0.218351
polarizability: 2.64976565e+02 8.76743834e-04 1.50581442e+02 -4.81594131e-03 -8.97071471e+00 1.05950470e+02
1716.lowfreq: -13.9240 -13.1997 -4.8673 -0.0023 -0.0020 0.0015 0.9463 13.7323 16.9307
frequency: -12.5388 13.5605 16.8980 36.5967 63.8389 86.4211 118.9310 126.7573 160.8708 221.2077 230.7882 245.3373 248.2750 364.3714 406.9950 425.3492 473.9004 506.9198 512.9991 526.1705 534.8470 563.8793 568.4673 590.9945 670.9268 671.5041 719.2877 818.7529 819.0962 859.1959 860.9027 928.9083 929.0938 971.9454 972.4244 994.8666 995.1118 1132.8968 1133.1952 1191.9443 1192.1541 1261.7619 1261.8514 1301.1673 1302.0574 1444.5518 1444.5867 1455.5097 1455.5718 1572.4800 1573.8275 1681.8319 3004.0846 3004.1724 3048.4778 3048.5243 3076.1220 3076.1880 3133.5626 3133.5821
redmass: 10.6954 8.7060 7.0581 6.0861 8.5610 5.3792 2.3611 2.4478 14.8149 4.3814 9.8160 4.8260 7.1186 15.0261 14.1476 14.7974 10.4865 12.6352 7.4298 7.2561 8.7182 10.0455 10.3139 13.0249 3.1758 3.1486 11.6060 1.7273 1.7255 7.5120 7.5518 3.1376 3.1313 3.4468 3.4287 1.8414 1.8487 1.2318 1.2329 1.1334 1.1336 1.1697 1.1706 1.2567 1.2548 1.1040 1.1030 1.0955 1.0957 7.9561 7.9757 13.2907 1.0629 1.0629 1.0597 1.0597 1.0988 1.0987 1.1096 1.1096
irintensity: 0.0225 1.0661 0.0738 1.1205 0.8114 6.6851 1.7987 1.4507 1.2416 6.2478 0.2121 2.1453 8.6080 2.7880 29.1783 0.6195 0.1493 1.1084 5.4722 11.4475 4.3733 2.0409 123.5415 6.2633 5.7179 0.9295 805.8998 6.4454 2.3830 118.7487 115.7747 37.7730 9.4271 1.7980 14.9374 2.8161 0.4078 2.6334 2.7080 2.3939 13.7590 17.2441 3.5337 6.8395 12.8981 6.8330 5.3874 3.7832 4.9332 141.3903 42.2726 141.4962 0.3764 46.8639 43.5129 3.2530 25.2203 10.5105 5.1735 16.8799
temp: 298.150 k
press: 1.00000 atm
elementType: 16 16 16 16 8 7 7 6 6 6 6 6 6 6 1 1 1 1 1 1 1 1
symmnumber: 1
zpe: 377939.2 jmol-1
zpe.correction: 0.143949 hartree
zpe.thermalcorrener: 0.158646 hartree
zpe.thermalcorrenthalpy: 0.159591 hartree
zpe.thermalcorrgfe: 0.097643 hartree
zpe.sumelectzpe: -2047.419520 hartree
zpe.sumelectthermal: -2047.404823 hartree
zpe.sumelectthermalent: -2047.403879 hartree
zpe.sumelectthermalfe: -2047.465827 hartree
dipole: 0.0002 2.7416 1.3108
dipole: 3.0388
quadrupole: -71.1748 -108.9692 -116.1855
quadrupole: -0.0017 0.0110 4.2512
quadrupole: 27.6017 -10.1927 -17.4090 -0.0017 0.0110 4.2512
hfenergy: -2047.5634699 hartree
pointgroup: C01 [X(C7H8N2O1S4)]
dipole: 0.0003103 0.9808187 -0.6836602 debye
dipolederiv: -0.5061824 0.1285628 0.2617014 -0.0820973 -0.1937359 -0.0725581 0.2793014 -0.1658677 -0.2392063 -0.5059426 -0.1284401 -0.2617351 0.0821868 -0.193849 -0.072393 -0.2795918 -0.165782 -0.2392804 -1.3408606 0.0065914 0.0393791 0.2654726 0.0025976 -0.0067785 0.0165231 0.0088464 -0.0362822 -1.3408598 -0.0054805 -0.0389752 -0.2641793 0.0028477 -0.0067147 -0.0154581 0.0087056 -0.0362792 -0.695283 0.000084 0.0002962 0.0002872 -0.6481154 0.3914368 0.0005563 0.3739112 -0.3870213 -0.5813355 0.00995 0.1324198 -0.1875618 -0.7498602 -0.2382026 0.2228894 -0.2896162 -0.4215889 -0.5809312 -0.0100827 -0.1325387 0.1872116 -0.7501661 -0.2379822 -0.2233444 -0.2892665 -0.4214145 0.1089568 0.1097952 0.079554 0.2264576 0.0041262 -0.095713 0.2094926 -0.0336279 0.0698586 0.1088365 -0.1098886 -0.0795367 -0.2265687 0.0042361 -0.0957486 -0.2093262 -0.0335229 0.0698162 0.2506571 -0.0314346 0.0041301 -0.0403472 0.2508237 0.0235257 0.0140598 -0.0059509 0.2251606 0.2506095 0.0315114 -0.0041889 0.0403431 0.250746 0.0235424 -0.0141127 -0.0058706 0.2251364 1.2102746 0.0033909 -0.5531915 0.4759016 0.6149517 0.3413034 -0.8684803 0.3982994 0.4169403 1.2092887 -0.0035529 0.5535241 -0.4756148 0.6157121 0.34092 0.8693159 0.3976992 0.4168241 2.6089182 -0.0011602 -0.0008358 -0.0016197 0.5620458 -0.4019248 -0.0017214 -0.4029875 0.3379681 0.0117094 -0.0398686 0.058512 -0.0850742 0.0731967 0.0556859 0.0776077 0.0434202 -0.0332597 -0.0905178 -0.0026065 -0.0684889 -0.0462877 0.035831 0.0141654 -0.1411743 0.004035 0.0204168 -0.0906298 0.0027341 0.068436 0.0464508 0.0358273 0.0141297 0.141065 0.0039324 0.0205363 0.011865 0.0398524 -0.0584507 0.0850394 0.073152 0.0557068 -0.077605 0.0434331 -0.033408 0.0018763 -0.0738451 -0.0253994 -0.0725956 -0.0021245 -0.0677327 -0.062256 -0.0905857 0.0292906 -0.0211752 0.0264588 -0.0512328 0.0277417 0.0069478 0.0515518 0.0188756 0.1456979 -0.0067864 -0.0211921 -0.0264887 0.0512909 -0.0277839 0.0070949 0.0514856 -0.0187638 0.1456664 -0.0068302 0.0019178 0.0739174 0.0253301 0.0726374 -0.0022856 -0.0677054 0.0621471 -0.0905689 0.029409 unknown
polarizability: 264.9765474|-0.0452775|152.2783167|0.0021122|1.3645584|104.2536133 unknown
InChI: InChI=1S/C7H8N2OS4/c10-7(13-5-8-1-3-11-5)14-6-9-2-4-12-6/h1-4H2
charge 0 multiplicity 1
22 atoms
S  4.053876 -0.986026 -0.774135
S  -4.053149 -0.983389 -0.773933
S  1.50501 -1.317698 1.024082
S  -1.50526 -1.31555 1.025643
O  0.000665 0.693656 -0.206889
N  2.988591 1.003252 0.763013
N  -2.987254 1.006148 0.762447
C  5.088397 0.602474 -0.563985
C  -5.086673 0.605976 -0.565415
C  4.107257 1.663287 0.035584
C  -4.105175 1.666481 0.034145
C  2.841421 -0.230093 0.415442
C  -2.840746 -0.227509 0.415703
C  0.000258 -0.344769 0.446312
H  5.473603 0.898423 -1.550759
H  5.921552 0.368641 0.116455
H  -5.920438 0.373151 0.114622
H  -5.471034 0.901597 -1.552616
H  4.636105 2.338788 0.729223
H  3.653685 2.281088 -0.763269
H  -3.650834 2.283637 -0.764768
H  -4.633957 2.342631 0.727202
