program: Gaussian 09
title: 000229031
version: EM64L-G09RevD.01
frameworkgroup: C1[X(C7H12N2OS)]
method: RPBEPBE
basis: SDD
operation: Freq
keyword: #p
keyword: freq=noraman
keyword: PBEPBE/SDD
title: #p freq=noraman PBEPBE/SDD
converged: YES YES NO NO
title: Mulliken charges:
elementType: S O N N C C C C C C C H H H H H H H H H H H H
charge: 0.121266 -0.247300 -0.114323 -0.084074 -0.374503 -0.360545 -0.299820 -0.289250 -0.077765 -0.661494 -0.395464 0.224333 0.266890 0.231827 0.229138 0.202733 0.221192 0.221498 0.197586 0.259117 0.275705 0.228644 0.224608
chargesum: 0.00000
title: Mulliken charges with hydrogens summed into heavy atoms:
elementType: S O N N C C C C C C C
charge: 0.121266 -0.247300 -0.114323 -0.084074 0.116720 0.100421 0.124106 0.129833 -0.077765 -0.126671 0.057788
polarizability: 1.41734502e+02 3.92373793e+00 1.09449584e+02 8.13699842e+00 2.20185590e+00 7.30697572e+01
1716.lowfreq: -12.4382 -8.0818 0.0018 0.0020 0.0023 11.4422 25.9914 67.4103 131.2424
frequency: 19.2082 67.1495 131.2421 146.1640 209.9908 238.3597 260.8077 308.9218 380.2869 395.5468 456.8156 474.6872 555.1401 572.4741 599.2862 621.7584 668.3644 789.5593 831.1656 837.0972 854.6281 906.5757 926.7249 988.1404 1002.0230 1013.5096 1019.8501 1050.9838 1068.4890 1102.9509 1133.9999 1177.5958 1186.6307 1193.8820 1215.7143 1260.8308 1264.0498 1272.1562 1305.9766 1328.9440 1341.4701 1357.1097 1363.5674 1399.4244 1443.9921 1444.6149 1445.7868 1450.0970 1453.7664 1470.4033 1651.0527 2952.4874 2960.0905 2967.3328 2974.8054 2979.9090 3035.3546 3049.4433 3070.4312 3081.6591 3086.2277 3090.7523 3124.4377
redmass: 4.3855 4.4534 2.7495 3.8658 2.5115 2.4259 3.2501 4.0195 3.5122 2.3201 2.8542 6.0387 3.2713 6.4133 6.7455 2.4820 3.1279 4.4162 1.6831 1.8587 3.5420 2.5413 2.8328 3.9658 1.5083 2.4374 2.5255 2.3124 3.3773 2.1568 1.3048 1.1841 2.6377 1.1512 1.5258 1.2869 1.3714 1.2031 1.2718 1.2224 1.2358 1.2994 1.3257 2.5899 1.0821 1.0869 1.0882 1.1021 1.0985 1.0934 8.6318 1.0677 1.0677 1.0661 1.0643 1.0653 1.0707 1.0831 1.0968 1.0975 1.0973 1.0980 1.1092
irintensity: 0.0603 0.1050 4.8910 0.6988 14.5744 4.5757 9.7954 8.6216 13.5510 3.3794 1.5357 2.2597 7.9699 13.1558 18.8214 4.3556 1.6310 13.6001 0.1740 7.3590 20.6052 12.1270 2.8140 150.0987 3.8093 8.9589 7.1429 30.0112 26.8045 4.0573 2.4012 26.6548 29.3494 3.2851 81.3763 44.0373 24.6972 3.7377 46.1338 3.3700 3.3571 4.0806 0.4542 39.1458 15.0383 3.5946 1.2143 27.8909 6.2603 4.4563 468.6231 48.2751 43.9855 83.2825 31.2019 87.1684 10.4306 50.8163 14.6167 39.2681 41.4231 5.4434 17.1589
temp: 298.150 k
press: 1.00000 atm
elementType: 16 8 7 7 6 6 6 6 6 6 6 1 1 1 1 1 1 1 1 1 1 1 1
symmnumber: 1
zpe: 496641.0 jmol-1
zpe.correction: 0.189161 hartree
zpe.thermalcorrener: 0.199726 hartree
zpe.thermalcorrenthalpy: 0.200670 hartree
zpe.thermalcorrgfe: 0.151552 hartree
zpe.sumelectzpe: -855.836603 hartree
zpe.sumelectthermal: -855.826037 hartree
zpe.sumelectthermalent: -855.825093 hartree
zpe.sumelectthermalfe: -855.874212 hartree
dipole: 1.0543 -0.1608 0.3668
dipole: 1.1278
quadrupole: -73.1022 -72.8640 -72.9545
quadrupole: 1.1775 2.9089 -0.4415
quadrupole: -0.1286 0.1096 0.0190 1.1775 2.9089 -0.4415
hfenergy: -856.0257634 hartree
pointgroup: C01 [X(C7H12N2O1S1)]
dipole: -0.4137006 0.0976275 0.1273219 debye
dipolederiv: -0.3992211 0.2186965 0.0402132 0.253143 -0.5658755 0.005569 0.0410816 0.0034533 -0.1261302 -0.5318781 0.0002431 -0.0844312 0.007302 -0.7582351 -0.0082482 -0.1081151 0.0013396 -0.4585529 -1.6134847 -0.112107 0.0706026 0.1284908 -0.5566098 0.0187623 0.0275679 0.0407686 -0.364612 -1.0452495 -0.0689336 0.0513424 -0.4453441 -1.0456849 0.0649216 0.2625614 0.1035382 -0.3653811 0.1782566 -0.2285074 -0.0757487 -0.4542265 0.2267742 0.0614253 -0.1041488 0.0589955 0.2519653 0.2758281 0.2487617 -0.0816142 0.3813686 0.2561285 -0.0486804 -0.1699067 -0.0743508 0.2511192 0.3478216 0.1966763 -0.010168 0.1680827 0.5048883 -0.0363734 0.092622 -0.0454692 0.3432317 0.3507334 -0.2034205 -0.0198713 -0.1527141 0.5030979 0.0335048 0.0899449 0.0425156 0.343664 2.0007797 -0.0627002 -0.1779773 -0.0075854 1.1331818 -0.0854328 -0.3128774 -0.1424457 0.0855112 0.1972812 -0.0132443 -0.0545359 0.1607259 -0.1044617 -0.0846069 -0.1020481 -0.0349404 0.190569 0.5317249 0.1110062 0.0195518 -0.0264547 0.3018256 0.010166 -0.0128384 0.0438474 0.2813064 -0.0537455 0.080765 0.0769586 0.0905774 0.0601596 0.029951 0.0965383 -0.0454566 -0.1403737 0.1239191 -0.129043 -0.0042336 -0.0226105 0.0112926 0.0080364 -0.0108005 0.0196999 0.0988541 0.0328284 0.1310821 -0.0079937 0.0705239 -0.0167368 -0.0182457 0.0073332 -0.0138897 0.0918873 -0.0550021 -0.0818115 0.0773856 -0.0751262 0.0528294 -0.025413 0.1051367 0.0568646 -0.1411991 0.0164617 -0.0904094 0.097383 -0.0323762 0.0136773 -0.0409832 0.0482552 0.0463881 -0.1662542 -0.0682071 0.1199572 -0.0024339 0.086939 -0.0907933 -0.0038462 0.0033262 -0.0298845 0.0932694 -0.06231 -0.1156202 -0.0020486 -0.0921577 -0.0980692 0.0071697 0.0081744 0.0374398 0.0899814 0.0075322 0.0942297 0.1002441 0.0326348 0.0131028 0.0354764 0.0507444 -0.054133 -0.1704882 -0.1149141 0.0546304 -0.0340905 0.0470273 0.0832656 0.0268364 -0.0524674 0.0353699 0.0652371 0.0250209 -0.0170053 0.0273312 -0.0519462 0.0461522 0.0078071 0.0889775 -0.0377446 -0.1398568 -0.0166433 -0.0608175 0.0528232 -0.0969253 -0.0237084 0.0873184 0.1154931 0.0945821 -0.0035243 -0.1275324 -0.0724283 -0.0586887 0.0306517 0.0537986 -0.0451143 -0.1645543 -0.1064883 -0.1102234 unknown
polarizability: 142.5415522|1.4528226|108.8093637|-6.3013964|-3.4593402|72.9029275 unknown
InChI: InChI=1S/C7H12N2OS/c1-6-11-7(8-1)9-2-4-10-5-3-9/h1-6H2
charge 0 multiplicity 1
23 atoms
S  -1.911537 1.557573 -0.333537
O  3.206197 0.01973 0.329077
N  0.448327 0.006311 -0.472282
N  -1.586768 -1.149705 -0.015639
C  1.251078 -1.236274 -0.555194
C  1.236472 1.248237 -0.568503
C  2.378799 -1.192785 0.492437
C  2.37379 1.225475 0.476341
C  -0.908502 -0.058958 -0.254922
C  -3.36065 0.559216 0.370287
C  -3.045905 -0.929906 0.018184
H  1.69144 -1.314392 -1.56995
H  0.577263 -2.091064 -0.383378
H  0.586078 2.122922 -0.396648
H  1.674556 1.328404 -1.584288
H  1.945788 -1.216068 1.515336
H  3.073931 -2.038768 0.364703
H  3.059943 2.076251 0.331109
H  1.941885 1.263697 1.499925
H  -4.290141 0.915452 -0.099393
H  -3.390874 0.73117 1.457973
H  -3.50824 -1.598725 0.766528
H  -3.478433 -1.181893 -0.972265
