program: Gaussian 09
title: 000229022
version: EM64L-G09RevD.01
frameworkgroup: C1[X(C12H23N3)]
method: RPBEPBE
basis: SDD
operation: Freq
keyword: #pfreq=noraman
keyword: PBEPBE/SDD
title: #p freq=noraman PBEPBE/SDD
converged: YES YES NO NO
title: Mulliken charges:
elementType: N N N C C C C C C C C C C C C H H H H H H H H H H H H H H H H H H H H H H H
charge: -0.440637 -0.087059 -0.087210 0.193328 0.192782 0.154305 0.154441 -0.523042 -0.522877 -0.800377 -0.800369 -0.628464 -0.622224 -0.628537 -0.622147 0.249180 0.168762 0.249162 0.168785 0.292080 0.228043 0.228998 0.243140 0.228981 0.243130 0.228067 0.250248 0.173667 0.215550 0.219814 0.180746 0.229791 0.173721 0.215549 0.250344 0.219879 0.180755 0.229696
chargesum: 0.00000
title: Mulliken charges with hydrogens summed into heavy atoms:
elementType: N N N C C C C C C C C C C C C
charge: -0.148556 -0.087059 -0.087210 0.193328 0.192782 0.154305 0.154441 -0.105100 -0.104930 -0.100196 -0.100191 0.011000 0.008126 0.011078 0.008183
polarizability: 1.63551400e+02 2.48934332e-02 1.74317738e+02 -1.03884541e+01 3.40165136e-02 1.19500645e+02
1716.lowfreq: -16.1985 -11.2756 -3.4457 0.0006 0.0007 0.0007 32.3566 39.7960 57.3764
frequency: 32.2418 39.1577 57.3078 61.2317 61.7056 86.4462 91.0698 103.2145 165.7295 185.8758 213.6800 227.8472 235.5497 236.9989 250.3469 255.2917 270.8460 306.2871 334.4748 336.8238 346.4567 355.0821 369.9446 438.2523 450.5060 504.6022 535.2253 593.7693 619.8773 645.8984 677.5501 782.3485 804.3252 813.6864 852.5931 939.7023 949.4458 989.7286 1004.4440 1008.2033 1030.6069 1031.0245 1035.4167 1042.7886 1044.6764 1087.1578 1088.2922 1104.7935 1136.2068 1140.9058 1178.4127 1189.7780 1211.3537 1238.0692 1248.5850 1251.3085 1277.1875 1278.9341 1326.8493 1364.6793 1368.2447 1400.4488 1403.8357 1409.6068 1410.6654 1430.3235 1434.1574 1445.7110 1446.5000 1452.7466 1453.8235 1455.1717 1456.5741 1468.7225 1469.2695 1470.2641 1471.8005 1473.6104 1474.2816 1475.1369 1480.1267 1483.5883 1484.1517 1567.1936 1622.6149 2821.0541 2821.9981 2824.9376 2825.2646 2844.8462 2848.1798 2955.9270 2957.6559 3010.2907 3010.9111 3013.3195 3015.1699 3019.7559 3020.2723 3021.7241 3021.9647 3071.0839 3071.2349 3082.8072 3082.9459 3085.9391 3086.0731 3591.6223
redmass: 3.2705 2.5029 2.5141 2.4417 2.0485 1.2306 1.6421 2.0086 2.8187 3.0269 1.3612 1.1438 1.1628 1.1194 2.2710 2.3397 1.8277 2.5922 2.5224 3.7626 2.6037 1.9838 2.4912 2.4302 2.8727 2.6251 1.2473 4.2738 3.1838 4.2320 5.4756 3.9315 4.7216 4.6079 3.0623 2.0252 1.5371 1.5556 2.4616 2.4371 1.4836 1.5020 1.4184 1.8406 1.4596 1.2801 1.2544 2.0375 1.4659 1.7370 2.2111 2.4992 3.5866 1.6577 2.4705 2.4527 1.5257 1.4094 3.7869 1.4531 1.3573 1.2524 1.2735 1.1422 1.1435 1.2060 1.1884 2.1648 5.1685 1.0827 1.0932 1.0514 1.0521 1.0577 1.0514 1.0653 1.0788 1.0578 1.1437 1.0735 1.1933 1.0610 1.0530 6.1626 5.5941 1.0683 1.0672 1.0588 1.0594 1.0592 1.0599 1.0393 1.0392 1.0705 1.0705 1.0862 1.0844 1.0708 1.0729 1.0980 1.0983 1.1010 1.1011 1.1002 1.1002 1.0944 1.0942 1.0803
irintensity: 0.2233 0.6557 0.3934 0.5242 0.5779 0.0859 1.6917 2.5226 0.2017 3.1465 0.0155 0.9651 0.3064 0.1742 1.6941 0.4170 1.4607 12.2032 0.0002 9.1998 0.2903 12.8815 0.7601 0.8411 0.4338 4.6764 72.6908 0.0526 11.1192 7.3941 0.9143 5.3949 41.7312 2.3050 1.6255 0.1167 0.5491 1.6977 68.5139 68.7365 5.0976 13.2528 0.1077 1.8527 5.6033 3.7607 2.4599 17.6164 9.2558 0.1702 6.8042 3.4050 2.4935 7.1436 2.0941 9.1138 7.4763 23.7677 36.5838 0.3016 8.5374 8.1368 0.5498 8.2736 1.3584 7.0822 3.5341 42.0067 14.2631 2.7531 3.3055 10.7355 21.0334 0.2801 12.1060 5.8865 44.6282 6.0609 9.9786 6.0785 9.9844 21.7052 0.9281 19.4275 5.5909 84.4081 15.3075 34.6393 123.4290 595.7473 8.3064 90.3998 70.8982 15.1176 63.0044 12.5443 9.7904 79.2465 8.8447 6.1022 55.2368 66.4364 0.6280 23.5183 49.8789 6.6102 15.1200 34.8194
temp: 298.150 k
press: 1.00000 atm
elementType: 7 7 7 6 6 6 6 6 6 6 6 6 6 6 6 1 1 1 1 1 1 1 1 1 1 1 1 1 1 1 1 1 1 1 1 1 1 1
symmnumber: 1
zpe: 874197.1 jmol-1
zpe.correction: 0.332964 hartree
zpe.thermalcorrener: 0.351724 hartree
zpe.thermalcorrenthalpy: 0.352669 hartree
zpe.thermalcorrgfe: 0.285585 hartree
zpe.sumelectzpe: -634.091417 hartree
zpe.sumelectthermal: -634.072657 hartree
zpe.sumelectthermalent: -634.071713 hartree
zpe.sumelectthermalfe: -634.138796 hartree
dipole: 0.0079 2.2489 0.0031
dipole: 2.2489
quadrupole: -88.5794 -80.2906 -95.1865
quadrupole: 0.0139 -1.5836 0.0048
quadrupole: -0.5606 7.7283 -7.1677 0.0139 -1.5836 0.0048
hfenergy: -634.4243812 hartree
pointgroup: C01 [X(C12H23N3)]
dipole: -0.8846528 0.0154024 0.0028555 debye
polarizability: 174.315165|-0.1450425|165.7040636|-0.1525115|-2.9263655|117.3505541 unknown
InChI: InChI=1S/C12H23N3/c1-9-11(7-14(3)4)12(8-15(5)6)10(2)13-9/h13H,7-8H2,1-6H3
charge 0 multiplicity 1
38 atoms
N  -2.607498 0.043425 0.002852
N  1.531948 -1.824426 -0.732153
N  1.592146 1.774692 0.724159
C  -0.48444 -0.6832 0.21905
C  -0.462775 0.700304 -0.222066
C  -1.826178 -1.068029 0.355497
C  -1.791725 1.128852 -0.352773
C  0.743743 -1.50973 0.498679
C  0.790372 1.487253 -0.50469
C  -2.45826 -2.36712 0.77286
C  -2.382944 2.447949 -0.76737
C  0.788938 -2.671437 -1.683786
C  2.852074 -2.390892 -0.395837
C  0.87863 2.640605 1.681429
C  2.927191 2.302726 0.384123
H  1.411945 -0.925759 1.159572
H  0.463242 -2.451148 1.041422
H  1.437776 0.883539 -1.168535
H  0.538425 2.437827 -1.045338
H  -3.62599 0.05992 0.004427
H  -3.111985 -2.250998 1.660095
H  -3.070697 -2.815505 -0.034869
H  -1.676258 -3.098837 1.035426
H  -2.977994 2.915308 0.042627
H  -1.578685 3.154272 -1.032215
H  -3.043131 2.353376 -1.652379
H  -0.165364 -2.18177 -1.941826
H  0.557441 -3.691493 -1.276445
H  1.379047 -2.799539 -2.609637
H  3.444317 -2.534737 -1.318054
H  2.793109 -3.379985 0.130139
H  3.398375 -1.689574 0.260484
H  0.676683 3.668641 1.278514
H  1.475918 2.747492 2.605389
H  -0.089048 2.179167 1.941629
H  3.527434 2.425975 1.304148
H  2.895502 3.294896 -0.138452
H  3.449618 1.587661 -0.276793
