program: Gaussian 09
title: 000229002
version: EM64L-G09RevD.01
frameworkgroup: C1[X(C14H22O)]
method: RPBEPBE
basis: SDD
operation: Freq
keyword: #pfreq=noraman
keyword: PBEPBE/SDD
title: #p freq=noraman PBEPBE/SDD
converged: YES YES NO NO
title: Mulliken charges:
elementType: O C C C C C C C C C C C C C C H H H H H H H H H H H H H H H H H H H H H H
charge: -0.189529 0.215582 0.187036 0.196072 -0.093444 -0.603251 -0.161966 -0.433281 -0.541947 -0.518613 -0.453671 -0.747296 -0.759120 -0.757120 -0.126478 0.240055 0.218351 0.242452 0.242739 0.198263 0.195781 0.212501 0.232628 0.216226 0.214898 0.205903 0.206484 0.208346 0.226701 0.215382 0.217749 0.223466 0.214407 0.218034 0.234566 0.218467 0.183625
chargesum: 0.00000
title: Mulliken charges with hydrogens summed into heavy atoms:
elementType: O C C C C C C C C C C C C C C
charge: -0.189529 0.215582 0.187036 0.196072 0.146611 -0.142448 0.080773 -0.039237 -0.096817 -0.087489 -0.041284 -0.096867 -0.103498 -0.086052 0.057147
polarizability: 1.60553144e+02 -2.89190818e+00 1.45844600e+02 1.05986418e+00 -4.13333068e+00 1.30475420e+02
1716.lowfreq: -25.0228 -17.2478 -0.0003 0.0005 0.0006 8.5613 16.9713 52.6731 62.2337
frequency: -8.5684 52.1267 61.9199 106.6595 138.5747 179.2562 195.7475 217.9243 225.8096 249.8508 267.1427 271.2001 309.0045 321.8772 338.1276 350.2526 382.1037 385.2014 406.2709 430.9374 478.0928 480.1459 533.5117 564.9979 611.7948 624.0733 715.9122 780.6982 790.4085 826.6515 866.7776 882.0170 899.1127 910.3210 923.8777 925.3500 951.4157 969.9862 983.4605 989.0050 1018.3180 1028.0798 1049.3771 1063.9486 1068.8002 1090.1364 1125.4392 1128.5646 1148.6698 1158.4809 1174.9588 1182.3242 1197.7384 1205.9710 1222.5699 1247.2311 1266.7010 1274.4530 1283.7818 1327.1411 1333.8380 1335.3684 1339.5075 1342.6491 1348.4330 1367.3726 1370.0876 1380.6404 1382.4091 1391.2548 1453.1335 1454.8189 1458.1762 1463.5872 1464.9812 1471.4916 1475.7985 1479.3900 1481.8551 1489.5105 1490.1946 1632.8794 1676.6263 2856.3814 2936.9385 2942.3181 2962.0710 2965.3318 2970.3485 2974.8319 2975.6451 2980.0604 2983.5346 2993.1133 2995.0591 3000.2941 3003.4253 3025.3562 3043.9874 3061.6778 3067.2180 3067.8783 3074.0832 3076.1394 3079.4577
redmass: 4.5030 3.7513 2.9482 3.2804 2.3861 1.3687 2.2394 1.2620 1.5446 2.4431 1.5067 1.4784 2.4842 2.2282 2.4988 2.2324 2.5431 2.2316 2.8773 3.0724 3.4875 2.7854 2.6198 3.5671 3.0409 3.4881 3.0179 3.2541 2.2741 1.6518 1.9129 2.1963 1.8555 2.0589 1.5489 1.9134 1.9136 1.8749 1.6261 1.4068 1.9781 1.6122 2.1225 1.9543 2.1853 1.6919 1.8001 2.3338 1.2297 1.5015 2.3627 2.3129 1.7173 2.0620 1.3528 1.5924 1.5182 1.3357 1.6729 1.6857 1.5248 1.3916 1.5630 1.5234 1.4065 1.9340 1.1930 1.2586 1.2127 1.2046 1.0721 1.0761 1.0991 1.0656 1.0612 1.0503 1.0804 1.0655 1.0575 1.0608 1.0646 8.2730 7.2106 1.0853 1.0614 1.0631 1.0599 1.0580 1.0362 1.0357 1.0380 1.0797 1.0954 1.0843 1.0790 1.0962 1.0869 1.0986 1.1029 1.0994 1.0982 1.0992 1.0991 1.0995 1.0985
irintensity: 10.2152 1.7473 0.3852 0.8256 0.3308 0.8421 0.9293 1.0043 0.7530 0.4659 1.0978 0.3794 0.1934 2.0508 0.7327 1.5042 0.8654 2.7443 2.0947 1.5924 3.6485 3.2061 1.3428 0.1102 4.6280 0.7500 2.2941 2.1159 3.5105 3.9779 3.7591 10.8239 1.8481 2.5277 1.4636 2.3360 1.8538 6.9420 3.4211 1.1098 6.0842 3.6312 19.4747 7.0438 9.7091 10.1914 1.3932 1.8425 0.4198 3.1728 2.0852 2.8543 4.9138 1.1168 1.3839 11.3997 5.4934 2.5628 5.1012 3.1304 8.1204 3.1903 0.6540 3.0711 1.6699 2.2625 18.1008 4.9436 17.4723 13.7103 5.0262 3.3214 2.1026 9.9419 3.6086 13.5046 4.0048 14.4627 13.8012 1.5213 15.7683 172.8625 0.3479 95.8254 8.0041 74.6278 22.1731 24.2650 42.1510 29.3588 37.9215 19.7092 32.7341 16.5841 59.5494 21.4291 43.0314 50.9323 58.1955 12.7353 77.1972 28.5278 32.3944 41.2554 47.1550
temp: 298.150 k
press: 1.00000 atm
elementType: 8 6 6 6 6 6 6 6 6 6 6 6 6 6 6 1 1 1 1 1 1 1 1 1 1 1 1 1 1 1 1 1 1 1 1 1 1
symmnumber: 1
zpe: 855206.9 jmol-1
zpe.correction: 0.325731 hartree
zpe.thermalcorrener: 0.340543 hartree
zpe.thermalcorrenthalpy: 0.341488 hartree
zpe.thermalcorrgfe: 0.285254 hartree
zpe.sumelectzpe: -620.719507 hartree
zpe.sumelectthermal: -620.704694 hartree
zpe.sumelectthermalent: -620.703750 hartree
zpe.sumelectthermalfe: -620.759983 hartree
dipole: 2.7863 1.0526 1.8682
dipole: 3.5159
quadrupole: -104.0923 -90.7594 -96.1225
quadrupole: -4.9885 -8.9854 -3.2962
quadrupole: -7.1009 6.2320 0.8689 -4.9885 -8.9854 -3.2962
hfenergy: -621.0452379 hartree
pointgroup: C01 [X(C14H22O1)]
dipole: -1.0720954 -0.5325504 0.6931093 debye
polarizability: 160.491578|-2.3627192|144.1740863|-2.3549882|6.3301963|132.207499 unknown
InChI: InChI=1S/C14H22O/c1-10-7-11-5-4-6-14(2,3)13(11)8-12(10)9-15/h9-10,12H,4-8H2,1-3H3
charge 0 multiplicity 1
37 atoms
O  3.428657 1.46686 -1.561899
C  -1.838007 0.634475 0.462486
C  -0.388155 0.124617 0.288536
C  -0.084024 -1.035666 -0.372468
C  2.396976 -0.855998 0.353395
C  0.709476 0.989185 0.908834
C  2.124364 0.686966 0.368237
C  -2.861839 -0.486753 0.112234
C  1.343001 -1.549453 -0.542971
C  -1.136234 -1.929517 -1.017383
C  -2.501708 -1.235327 -1.184861
C  -2.078215 1.867634 -0.463143
C  -2.091438 1.066934 1.936666
C  2.407313 -1.437217 1.785578
C  2.308841 1.252748 -1.035571
H  3.400686 -1.00886 -0.090413
H  0.479179 2.062761 0.750413
H  0.710467 0.854316 2.009512
H  2.89462 1.157753 1.011892
H  -3.87257 -0.038579 0.040435
H  -2.890687 -1.216969 0.947209
H  1.355333 -2.64155 -0.342801
H  1.629792 -1.447922 -1.612454
H  -0.758957 -2.283329 -1.99944
H  -1.254838 -2.845782 -0.398239
H  -2.459076 -0.525587 -2.033706
H  -3.282535 -1.979979 -1.431226
H  -1.35038 2.675627 -0.264767
H  -1.992299 1.592922 -1.529526
H  -3.090303 2.282055 -0.292995
H  -1.874837 0.238595 2.637033
H  -1.475327 1.936205 2.229024
H  -3.152519 1.353238 2.066221
H  3.109053 -0.885066 2.438359
H  1.404079 -1.39966 2.247131
H  2.726164 -2.495972 1.766813
H  1.363447 1.461191 -1.602249
