program: Gaussian 09
title: 000021668
version: EM64L-G09RevD.01
frameworkgroup: C1[X(C19H30N2)]
method: RPBEPBE
basis: SDD
operation: Freq
keyword: #pfreq=noraman
keyword: PBEPBE/SDD
title: #p freq=noraman PBEPBE/SDD
converged: NO YES NO NO
title: Mulliken charges:
elementType: N N C C C C C C C C C C C C C C C C C C C H H H H H H H H H H H H H H H H H H H H H H H H H H H H H H
charge: -0.275705 -0.276098 -0.192346 0.023035 0.028644 -0.523095 -0.534643 -0.419014 -0.418172 -0.417890 -0.415100 0.506300 -0.439996 -0.438995 -0.444804 -0.439516 -0.397982 -0.465037 -0.250727 -0.227116 -0.249868 0.220060 0.208475 0.221736 0.218959 0.203112 0.211119 0.189278 0.212743 0.194903 0.189600 0.210201 0.206228 0.197596 0.187217 0.204645 0.171380 0.212155 0.212151 0.172962 0.177919 0.209702 0.209938 0.175596 0.262267 0.261166 0.228396 0.229666 0.221024 0.222196 0.225733
chargesum: 0.00000
title: Mulliken charges with hydrogens summed into heavy atoms:
elementType: N N C C C C C C C C C C C C C C C C C C C
charge: -0.013438 -0.014932 0.027713 0.231510 0.250380 -0.101024 -0.134246 -0.011367 -0.018372 -0.014066 -0.023238 0.506300 -0.056462 -0.053882 -0.057182 -0.053981 -0.169586 -0.235371 -0.029703 -0.004919 -0.024135
polarizability: 2.22777328e+02 2.34311983e+01 2.11882555e+02 3.84151286e+00 -2.20714441e+00 1.94846204e+02
1716.lowfreq: -10.3153 -9.7038 -0.0005 -0.0003 0.0005 5.3477 16.7466 24.3625 31.0226
frequency: 15.6064 24.3072 30.8966 39.9634 52.2418 58.5614 107.7542 115.1481 146.0956 160.1767 211.9039 231.9556 239.3035 245.3583 249.8652 269.4345 323.0819 327.9491 370.4496 402.6016 404.9646 433.5659 441.5020 447.7912 451.1835 459.4410 492.0335 522.8061 543.8229 578.9698 600.8677 617.0622 683.5525 685.3673 706.0992 753.4002 767.0978 782.2365 802.2504 809.1740 815.3291 850.9220 855.7117 876.7126 887.9207 902.7511 910.7833 916.5838 930.1973 969.1824 973.1538 978.5251 985.6421 987.1062 990.4064 992.0343 1010.2364 1027.4541 1048.0957 1062.8238 1063.3210 1074.0668 1079.8479 1090.7781 1097.0186 1112.2987 1125.0968 1129.2157 1144.6869 1145.1742 1161.1645 1170.5080 1171.5637 1178.5521 1187.8217 1194.5801 1201.3960 1206.3082 1221.9679 1249.5508 1260.1660 1266.1611 1268.9416 1283.7765 1287.3600 1294.8304 1299.5474 1306.7076 1314.9553 1320.7025 1325.2399 1326.8285 1332.7839 1341.7696 1347.6337 1352.5392 1352.8716 1359.9233 1383.7023 1385.4235 1388.2105 1440.2432 1441.4531 1442.6654 1447.8729 1448.9969 1452.1508 1455.7439 1462.4581 1465.6126 1466.1545 1468.1820 1474.6286 1476.6744 1481.3693 1590.9117 1611.3025 2829.7706 2834.5204 2837.2366 2842.1501 2946.7700 2951.8281 2953.8819 2955.3565 2969.1341 2972.2188 2975.2197 2976.0476 2981.6901 3010.2959 3018.1951 3024.2459 3025.9535 3028.1497 3029.7931 3033.4697 3035.9158 3042.1760 3043.0109 3110.3035 3113.5748 3129.3612 3139.6800 3159.5721 3449.0175 3452.9794
redmass: 2.9398 3.8919 4.0795 3.4082 4.0343 3.5488 3.3491 3.4697 3.0914 4.2336 3.3851 3.5892 1.8326 2.0512 2.2919 2.7099 1.8686 1.8759 3.2043 2.8124 2.3712 2.8867 2.9390 2.4194 2.8605 3.2829 1.9994 1.7476 1.8797 2.2658 3.5040 6.3815 1.7301 1.7738 1.6481 3.2315 1.9429 2.2162 2.0323 1.5038 1.7616 1.2668 2.0010 2.5570 2.2972 2.1630 1.7953 1.5649 1.9110 1.6446 1.4140 1.6716 1.9603 1.8848 5.5566 1.3273 2.1349 2.1419 2.8898 1.7764 1.8050 1.6753 1.7091 2.3747 2.2606 2.3281 2.4269 2.4070 1.3629 1.3847 1.9731 1.2124 1.9057 1.7848 1.1111 1.4683 1.3848 1.2365 1.5764 1.3317 1.3468 1.2226 1.2381 1.2490 1.2274 1.3194 1.3374 1.2442 1.2346 1.2836 1.2651 1.2701 1.4060 1.4670 1.4979 1.6173 1.5484 1.5263 4.2770 1.4357 1.4704 1.2748 1.8419 1.2041 1.2198 1.1901 1.0949 1.0977 1.0904 1.0866 1.0781 1.0766 1.1008 1.1030 2.2657 5.9393 6.1287 1.0722 1.0720 1.0700 1.0697 1.0792 1.0608 1.0803 1.0616 1.0594 1.0601 1.0612 1.0605 1.0812 1.1005 1.0990 1.0874 1.0873 1.0895 1.0890 1.1017 1.1025 1.1020 1.1018 1.0868 1.0860 1.0905 1.0957 1.1013 1.0751 1.0752
irintensity: 0.3605 0.0996 0.0709 0.2004 0.0142 0.4427 0.5730 0.1338 0.7062 0.1761 0.2307 0.3911 0.2919 0.4714 0.0114 0.1473 2.6669 2.3961 6.6877 0.0550 7.8099 4.7757 9.3540 1.3298 3.5485 10.8609 35.5676 76.2513 22.4473 15.5578 6.3062 0.1082 66.7864 98.3648 60.9457 3.4502 11.9946 20.6224 0.9490 0.1661 0.5750 0.1294 1.6842 1.9506 1.6742 2.3082 1.1154 1.9135 3.7737 2.1314 0.4025 10.3669 2.7881 2.6500 0.7144 0.0241 5.5091 11.4515 7.8362 2.5108 3.6342 5.6124 2.7695 5.6410 9.0367 5.2227 1.4276 0.6545 8.8993 15.5256 2.8057 2.5674 7.0394 1.8102 0.0438 5.6870 7.1212 1.8942 0.3522 8.8180 3.2774 3.9083 4.4544 0.9730 0.5364 0.8582 6.0956 6.9245 7.8194 40.6917 4.9504 1.9645 1.8726 1.6276 1.6600 6.4383 6.4653 2.2268 0.1430 3.1220 4.0772 1.6117 13.9648 7.8180 0.1613 0.3852 6.1223 9.8176 16.1103 5.5956 1.5136 0.2738 6.6529 7.5423 18.8262 1.6767 11.2306 52.0421 50.7322 168.2679 159.6688 10.8224 21.8224 9.8676 22.2874 35.3604 24.4511 45.9072 39.5869 17.0152 16.8271 33.6758 90.4943 103.9779 30.2038 28.7736 40.1418 16.4897 59.9945 137.1428 11.1347 6.2780 10.8144 44.8824 28.4797 3.5093 3.2199
temp: 298.150 k
press: 1.00000 atm
elementType: 7 7 6 6 6 6 6 6 6 6 6 6 6 6 6 6 6 6 6 6 6 1 1 1 1 1 1 1 1 1 1 1 1 1 1 1 1 1 1 1 1 1 1 1 1 1 1 1 1 1 1
symmnumber: 1
zpe: 1195550.0 jmol-1
zpe.correction: 0.455361 hartree
zpe.thermalcorrener: 0.475660 hartree
zpe.thermalcorrenthalpy: 0.476604 hartree
zpe.thermalcorrgfe: 0.403903 hartree
zpe.sumelectzpe: -849.874290 hartree
zpe.sumelectthermal: -849.853990 hartree
zpe.sumelectthermalent: -849.853046 hartree
zpe.sumelectthermalfe: -849.925747 hartree
dipole: 0.4783 -0.5940 -0.5113
dipole: 0.9181
quadrupole: -121.8775 -131.8712 -123.6651
quadrupole: 6.1930 3.3771 -1.2705
quadrupole: 3.9271 -6.0666 2.1395 6.1930 3.3771 -1.2705
hfenergy: -850.3296505 hartree
pointgroup: C01 [X(C19H30N2)]
dipole: 0.1547594 0.263249 0.1929598 debye
polarizability: 229.2789659|-20.9331133|205.1477688|-3.5806057|-2.6325707|195.0793531 unknown
InChI: InChI=1S/C19H30N2/c1-2-4-18(5-3-1)19(14-16-6-10-20-11-7-16)15-17-8-12-21-13-9-17/h1-5,16-17,19-21H,6-15H2
charge 0 multiplicity 1
51 atoms
N  -5.473496 0.152994 -0.457439
N  2.964239 3.932264 -0.446104
C  -0.113542 -0.490429 -0.063654
C  -2.708946 -0.296689 0.408256
C  1.546051 1.499297 0.374141
C  -1.427583 -1.168279 0.440327
C  0.243294 0.766306 0.780334
C  -3.064677 0.1980 -1.018323
C  -3.909381 -1.085417 0.995893
C  1.500371 2.040451 -1.079148
C  1.841111 2.668208 1.351514
C  1.014824 -1.525808 -0.089949
C  -4.391713 0.987276 -1.023162
C  -5.210024 -0.257036 0.939012
C  2.779196 2.834991 -1.421071
C  3.111553 3.441408 0.94169
C  1.570058 -2.041741 1.111678
C  1.510981 -2.024393 -1.321411
C  2.587507 -3.020282 1.082481
C  2.528856 -3.005467 -1.358137
C  3.072751 -3.507607 -0.1542
H  -0.286354 -0.166413 -1.109223
H  -2.554809 0.597563 1.051067
H  2.389043 0.777863 0.440911
H  -1.605221 -2.078179 -0.169829
H  -1.263358 -1.521833 1.480339
H  -0.596517 1.487636 0.716231
H  0.315925 0.473158 1.849325
H  -3.167638 -0.677168 -1.690501
H  -2.260395 0.843126 -1.422893
H  -3.696922 -1.374083 2.044793
H  -4.056949 -2.016448 0.413558
H  0.623184 2.708831 -1.194167
H  1.393054 1.208369 -1.801074
H  1.958431 2.279913 2.38322
H  0.984484 3.371695 1.350681
H  -4.238404 1.937495 -0.446282
H  -4.663208 1.267913 -2.057952
H  -6.063564 -0.860783 1.299715
H  -5.101707 0.620975 1.629103
H  3.644095 2.121038 -1.429081
H  2.697212 3.270671 -2.434445
H  3.263253 4.308531 1.611396
H  3.995521 2.761821 1.063505
H  -6.402177 0.576769 -0.576643
H  3.718473 4.575799 -0.71769
H  1.206372 -1.673712 2.07914
H  1.092431 -1.641184 -2.261115
H  3.002576 -3.404293 2.021769
H  2.896448 -3.375269 -2.322444
H  3.862491 -4.267048 -0.177941
