program: Gaussian 09
title: 000228987
version: EM64L-G09RevD.01
frameworkgroup: C1[X(C14H20O)]
method: RPBEPBE
basis: SDD
operation: Freq
keyword: #pfreq=noraman
keyword: PBEPBE/SDD
title: #p freq=noraman PBEPBE/SDD
converged: YES YES NO NO
title: Mulliken charges:
elementType: O C C C C C C C C C C C C C C H H H H H H H H H H H H H H H H H H H H
charge: -0.177688 0.138898 0.483323 -0.699259 -0.698191 -0.748209 0.507466 -0.603829 -0.405460 -0.423009 -0.111189 -0.455625 -0.414704 -0.712514 -0.086906 0.208415 0.214309 0.222753 0.214706 0.207929 0.223345 0.216835 0.216771 0.216322 0.230934 0.209996 0.225346 0.247022 0.250227 0.229119 0.232324 0.202055 0.252495 0.231506 0.154489
chargesum: 0.00000
title: Mulliken charges with hydrogens summed into heavy atoms:
elementType: O C C C C C C C C C C C C C C
charge: -0.177688 0.138898 0.483323 -0.053782 -0.052211 -0.098282 0.507466 -0.162900 -0.180114 -0.175986 0.139038 -0.226506 -0.182380 -0.026457 0.067583
polarizability: 2.13786689e+02 5.58016938e+00 1.40863289e+02 -7.21150083e+00 7.22206500e+00 1.09164249e+02
1716.lowfreq: -12.8010 -8.6917 -0.0008 -0.0006 0.0005 5.5271 25.9401 37.9170 49.3850
frequency: 25.5845 37.8898 49.2226 50.7801 61.8992 121.0928 187.1837 198.9495 208.5426 232.7561 244.9946 253.1055 290.8905 315.7149 319.8590 333.0149 339.2144 363.4050 373.8196 405.3753 425.5457 457.6941 511.9991 532.7626 577.1383 638.1507 662.3331 745.0012 799.1615 828.2621 838.8474 848.1377 864.6458 895.9533 909.8870 917.4654 931.2808 943.3676 947.9435 957.6187 971.2863 1009.9335 1020.2881 1025.5941 1061.5393 1089.8873 1109.1737 1128.2443 1140.2075 1197.9439 1204.3591 1208.3809 1215.9301 1222.6766 1255.6924 1272.1214 1308.4169 1320.1388 1322.4641 1371.7165 1375.3757 1375.8126 1383.7498 1393.1014 1403.3985 1406.5200 1460.1359 1464.9308 1468.3235 1469.1997 1476.4316 1479.1724 1481.0406 1487.0518 1496.2388 1507.4601 1576.2726 1621.5139 1643.7457 2834.4453 2972.6165 2973.6081 2978.1644 2978.5307 2980.8156 3026.5073 3043.3865 3067.6217 3068.5352 3070.7532 3075.0056 3077.0297 3078.6467 3082.0380 3091.2344 3109.8332 3113.5720 3135.4089 3156.4619
redmass: 3.5517 4.5257 3.7904 4.0642 3.7255 3.5301 2.2805 1.1876 1.1127 2.5480 2.2232 1.2106 2.8756 1.0585 2.4822 2.5572 2.7995 2.3363 2.2348 2.8216 3.5560 2.8407 3.0161 3.5301 2.4611 6.8687 3.9654 3.4976 3.4023 1.9617 2.6957 1.2644 2.0320 1.3990 1.8907 1.7448 1.6409 1.2061 2.0448 1.3581 1.3814 2.6722 1.5284 1.3870 1.6310 2.7478 2.5047 1.4273 2.1469 1.1615 2.9801 1.3473 2.6131 2.3712 1.2711 3.1320 1.3042 1.4088 1.3914 4.1642 1.2171 1.1883 1.1936 1.2365 1.2020 2.8155 1.0510 1.0480 1.0650 1.0821 1.0656 1.0719 1.0530 1.0511 1.1156 2.1517 6.4635 6.3532 7.8926 1.0835 1.0348 1.0347 1.0395 1.0360 1.0558 1.0899 1.0981 1.1000 1.1000 1.1004 1.0977 1.0985 1.0995 1.0989 1.1000 1.0870 1.0891 1.0955 1.0937
irintensity: 1.4977 2.0134 2.1485 0.8809 3.8724 0.3862 0.3274 0.1084 0.9193 1.2727 0.7546 0.1662 2.1208 0.0883 1.7524 2.1762 1.1192 0.9905 2.6037 0.0109 1.1265 0.1924 1.2287 9.8697 23.2279 0.0041 2.3413 1.4419 13.1595 30.5655 3.0212 0.7226 18.6997 4.1702 62.4715 2.9808 2.2670 0.1779 4.3778 0.1076 0.0690 5.5244 5.4212 0.1911 1.9587 15.0033 17.0084 10.5265 12.4818 2.5065 6.6089 1.6036 1.9224 0.5253 0.4858 33.2800 0.4162 0.7449 1.0740 4.4553 19.7826 19.0123 11.1018 4.7469 9.8309 8.1660 0.0717 0.6224 1.0165 1.8399 9.4729 15.7318 18.4308 11.4867 7.6760 48.3782 0.4415 0.7979 226.7664 122.3579 32.1441 32.7968 27.8747 33.7550 24.3293 1.5751 21.5678 6.8778 3.3162 17.6707 34.7565 128.0859 36.1650 47.7999 19.4824 11.0400 20.5707 27.8068 10.1896
temp: 298.150 k
press: 1.00000 atm
elementType: 8 6 6 6 6 6 6 6 6 6 6 6 6 6 6 1 1 1 1 1 1 1 1 1 1 1 1 1 1 1 1 1 1 1 1
symmnumber: 1
zpe: 789452.6 jmol-1
zpe.correction: 0.300687 hartree
zpe.thermalcorrener: 0.317292 hartree
zpe.thermalcorrenthalpy: 0.318236 hartree
zpe.thermalcorrgfe: 0.255512 hartree
zpe.sumelectzpe: -619.556975 hartree
zpe.sumelectthermal: -619.540370 hartree
zpe.sumelectthermalent: -619.539426 hartree
zpe.sumelectthermalfe: -619.602150 hartree
dipole: -3.1346 -1.9963 -0.2406
dipole: 3.7241
quadrupole: -108.7066 -89.4714 -93.5521
quadrupole: -11.5924 -3.9698 1.0676
quadrupole: -11.4632 7.7719 3.6913 -11.5924 -3.9698 1.0676
hfenergy: -619.8576619 hartree
pointgroup: C01[X(C14H20O1)]
dipole: -1.1868447 -0.8310616 -0.217774 debye
polarizability: 212.7037803|11.1304159|138.7740184|-7.1418277|11.49498|112.3364285 unknown
InChI: InChI=1S/C14H20O/c1-11(10-15)9-12-5-7-13(8-6-12)14(2,3)4/h5-8,10-11H,9H2,1-4H3
charge 0 multiplicity 1
35 atoms
O  5.389593 1.367547 0.421682
C  -3.470855 -0.0967 0.231228
C  -1.95846 0.044917 -0.063047
C  -3.701331 -1.314962 1.176169
C  -4.236381 -0.331815 -1.106374
C  -4.060227 1.16469 0.913744
C  0.862621 0.23827 -0.644913
C  2.354533 0.343419 -0.924095
C  -1.251862 -1.023811 -0.679063
C  -1.217129 1.213745 0.24975
C  3.224465 0.179212 0.373953
C  0.126601 -0.931329 -0.963211
C  0.163417 1.308342 -0.034828
C  3.075614 -1.23285 0.993598
C  4.681557 0.418633 0.00908
H  -4.780051 -1.433299 1.391313
H  -3.341231 -2.256306 0.723879
H  -3.169995 -1.174841 2.135325
H  -3.882683 -1.241939 -1.622935
H  -5.319001 -0.449971 -0.911722
H  -4.098018 0.522816 -1.793593
H  -5.137824 1.01101 1.106206
H  -3.573272 1.371392 1.884785
H  -3.959851 2.062015 0.275371
H  2.584133 1.329599 -1.372598
H  2.66039 -0.428255 -1.657779
H  -1.783383 -1.945087 -0.945621
H  -1.714536 2.068284 0.718038
H  2.920955 0.949353 1.107012
H  0.638469 -1.775449 -1.442407
H  0.702198 2.231523 0.215192
H  3.424611 -2.014461 0.291241
H  2.016415 -1.435389 1.227742
H  3.660813 -1.322334 1.925943
H  5.104304 -0.34717 -0.697765
