program: Gaussian 09
title: 000228986
version: EM64L-G09RevD.01
frameworkgroup: C1[X(C14H20O)]
method: RPBEPBE
basis: SDD
operation: Freq
keyword: #pfreq=noraman
keyword: PBEPBE/SDD
title: #p freq=noraman PBEPBE/SDD
converged: YES YES NO NO
title: Mulliken charges:
elementType: O C C C C C C C C C C C C C C H H H H H H H H H H H H H H H H H H H H
charge: -0.178623 -0.088412 -0.624212 0.521695 -0.381515 -0.233385 0.545895 -0.398638 -0.441758 -0.464645 -0.404401 -0.083736 -0.698013 -0.693221 -0.690827 0.246857 0.216217 0.210659 0.199188 0.212513 0.206823 0.226619 0.225464 0.229794 0.227214 0.142954 0.234745 0.217754 0.216856 0.210237 0.211891 0.226363 0.230756 0.210622 0.210271
chargesum: 0.00000
title: Mulliken charges with hydrogens summed into heavy atoms:
elementType: O C C C C C C C C C C C C C C
charge: -0.178623 0.158444 -0.197337 0.521695 0.030186 -0.026561 0.545895 -0.172020 -0.216294 -0.234851 -0.177187 0.059218 -0.028657 -0.044731 -0.039177
polarizability: 2.00308654e+02 1.39894343e+01 1.23781227e+02 -3.52408567e+00 6.89685691e+00 1.31747122e+02
1716.lowfreq: -19.1523 -14.0543 -5.7908 -0.0006 -0.0003 0.0003 0.8245 27.4818 36.8814
frequency: -14.9287 26.2860 36.7896 41.5360 48.7095 78.8098 111.1260 172.9882 194.4996 207.9861 211.1340 225.1182 241.1678 274.9064 302.7821 328.3081 347.8519 364.9569 404.8276 432.1787 458.3486 515.3932 542.1147 576.1242 637.5588 701.8958 750.0418 760.3501 811.9186 826.2472 846.2251 856.2057 887.1229 890.1974 917.4287 937.0928 953.6894 955.0920 970.2085 994.6434 1011.8337 1021.2188 1050.7468 1068.5867 1090.8055 1112.3089 1113.5725 1127.5773 1155.5475 1186.3526 1193.2997 1218.3349 1222.0732 1236.4706 1263.6538 1293.8760 1307.3008 1307.7211 1313.5277 1330.0406 1341.1562 1376.3599 1384.3618 1387.3248 1394.3483 1399.9976 1415.3741 1462.0397 1465.9710 1467.8461 1473.5935 1476.4248 1478.6284 1483.1837 1483.8899 1508.0567 1583.2428 1623.8213 1648.6052 2816.5799 2964.5026 2973.3474 2974.0187 2976.8666 2977.8838 2983.0751 3012.8675 3022.3745 3038.5051 3066.1447 3073.6935 3076.8741 3078.3886 3081.8595 3082.2038 3105.6602 3107.8135 3128.8996 3135.7079
redmass: 3.3978 3.4608 5.2382 3.5307 3.1367 2.2084 3.2514 2.5261 2.4175 1.2608 1.3120 2.6350 1.1271 2.6184 2.8448 2.4566 2.0128 3.2480 2.8156 3.2346 3.0906 4.0484 3.0435 2.4181 6.7187 3.1979 3.3315 1.2252 3.8923 1.7204 1.2774 1.8270 1.9973 2.4553 1.1767 1.5839 1.4457 1.3985 1.3843 1.9123 3.0712 3.0426 1.6324 1.9949 2.0410 1.8088 2.5490 1.6021 1.7395 1.4127 1.1103 2.6099 1.8533 1.3127 1.2173 1.6266 1.4913 1.3319 1.3669 1.4408 1.3768 1.1949 3.4337 1.2569 1.2685 1.2066 2.4025 1.0865 1.0447 1.0509 1.0881 1.0414 1.0480 1.0992 1.0583 2.4370 6.4129 6.4390 8.1181 1.0830 1.0603 1.0353 1.0591 1.0435 1.0753 1.0364 1.0926 1.0980 1.0963 1.1000 1.0991 1.1004 1.0998 1.1000 1.0997 1.0868 1.0868 1.0958 1.0967
irintensity: 1.4237 0.2863 6.3668 0.1692 1.0750 0.1656 0.7358 0.4551 0.6460 0.2863 0.5895 0.8655 0.0977 1.2324 1.2958 3.3882 0.4641 0.5452 0.0257 1.0869 0.1901 2.2147 5.7178 30.4887 0.0140 0.9257 0.7129 17.6986 5.0077 12.5441 3.1106 37.0259 1.1945 1.4800 3.1149 3.5032 0.0391 0.3054 0.1562 4.8106 4.8680 9.9196 26.6429 5.1469 9.5862 21.8289 1.8305 0.9367 0.3523 9.4521 0.4144 0.2258 1.8405 1.0029 1.6797 6.1358 4.2427 1.2387 4.8885 0.5605 1.3218 15.5655 2.3505 1.1305 9.2084 13.8882 5.2720 0.1794 3.2408 2.8393 9.1928 14.2147 16.9553 6.5194 10.1389 36.4570 0.0315 1.7284 130.2723 95.5721 23.2729 27.9532 57.2347 35.2408 17.2175 29.2523 11.7867 2.1815 36.2731 2.3893 105.1013 26.1820 46.2016 39.1359 38.7084 6.9312 28.6560 45.6279 1.7511
temp: 298.150 k
press: 1.00000 atm
elementType: 8 6 6 6 6 6 6 6 6 6 6 6 6 6 6 1 1 1 1 1 1 1 1 1 1 1 1 1 1 1 1 1 1 1 1
symmnumber: 1
zpe: 789512.6 jmol-1
zpe.correction: 0.300709 hartree
zpe.thermalcorrener: 0.316736 hartree
zpe.thermalcorrenthalpy: 0.317681 hartree
zpe.thermalcorrgfe: 0.255659 hartree
zpe.sumelectzpe: -619.557628 hartree
zpe.sumelectthermal: -619.541601 hartree
zpe.sumelectthermalent: -619.540657 hartree
zpe.sumelectthermalfe: -619.602678 hartree
dipole: -0.1628 -2.7833 0.8241
dipole: 2.9073
quadrupole: -81.2203 -101.4780 -87.1785
quadrupole: 9.2842 -3.8780 4.8919
quadrupole: 8.7386 -11.5191 2.7804 9.2842 -3.8780 4.8919
hfenergy: -619.8583377 hartree
pointgroup: C01 [X(C14H20O1)]
dipole: -0.0506496 -0.969625 0.6046212 debye
polarizability: 199.8343793|14.4324726|128.7065319|-5.5886713|8.1095242|127.2960919 unknown
InChI: InChI=1S/C14H20O/c1-4-12(10-15)9-13-5-7-14(8-6-13)11(2)3/h5-8,10-12H,4,9H2,1-3H3
charge 0 multiplicity 1
35 atoms
O  -2.513099 2.074322 -0.90617
C  -2.766124 -0.276062 -0.174435
C  -1.77624 -1.006555 0.789301
C  -0.310009 -0.733574 0.482906
C  -4.237192 -0.703536 0.125936
C  3.904604 0.113001 -0.491642
C  2.441729 -0.180245 -0.147069
C  0.337606 -1.385295 -0.596211
C  0.443149 0.196111 1.244364
C  1.68854 -1.112868 -0.904086
C  1.793114 0.467704 0.9359
C  -2.651353 1.230637 0.008934
C  -5.263433 -0.158723 -0.889999
C  4.8570 -0.27993 0.669156
C  4.108551 1.598551 -0.893175
H  -2.520162 -0.519531 -1.225354
H  -1.985555 -2.091978 0.716851
H  -2.010182 -0.707767 1.830967
H  -4.508765 -0.378075 1.151962
H  -4.271304 -1.81137 0.133908
H  4.170899 -0.510662 -1.369241
H  -0.218609 -2.114655 -1.199364
H  -0.03163 0.710399 2.089828
H  2.168039 -1.63165 -1.74388
H  2.344943 1.193006 1.546354
H  -2.741821 1.558735 1.082428
H  -5.275843 0.945914 -0.906885
H  -5.026778 -0.501265 -1.91414
H  -6.282988 -0.505868 -0.642487
H  4.648505 0.320991 1.574043
H  5.911078 -0.104855 0.383616
H  4.741897 -1.345518 0.937694
H  3.452083 1.878256 -1.736426
H  5.157737 1.780179 -1.19246
H  3.877117 2.272979 -0.047723
