program: Gaussian 09
title: 000228983
version: EM64L-G09RevD.01
frameworkgroup: C1[X(C12H16O)]
method: RPBEPBE
basis: SDD
operation: Freq
keyword: #pfreq=noraman
keyword: PBEPBE/SDD
title: #p freq=noraman PBEPBE/SDD
converged: YES YES NO NO
title: Mulliken charges:
elementType: O C C C C C C C C C C C C H H H H H H H H H H H H H H H H
charge: -0.177652 -0.603180 -0.112160 0.501624 0.488460 -0.393128 -0.417134 -0.711278 -0.404312 -0.417684 -0.532010 -0.085840 -0.672189 0.231295 0.210150 0.250117 0.233479 0.229385 0.202043 0.251997 0.231650 0.230867 0.230671 0.209731 0.209136 0.154459 0.221843 0.217219 0.222444
chargesum: 0.00000
title: Mulliken charges with hydrogens summed into heavy atoms:
elementType: O C C C C C C C C C C C C
charge: -0.177652 -0.161735 0.137957 0.501624 0.488460 -0.159649 -0.187749 -0.025588 -0.173445 -0.187014 -0.113143 0.068619 -0.010684
polarizability: 1.84163681e+02 4.74017656e+00 1.19933478e+02 6.05956913e+00 -1.05150366e+01 9.08437137e+01
1716.lowfreq: -14.7262 -7.1130 0.0003 0.0008 0.0008 3.4942 10.0715 34.4038 42.7020
frequency: -7.2433 34.1694 42.6831 54.0614 60.9387 133.5686 194.7054 209.2800 222.1097 252.8442 284.3766 324.2933 344.0714 381.3008 403.5104 412.9302 472.9294 535.2337 585.9569 638.2377 708.7433 755.1851 783.3773 806.5926 831.5071 851.2154 864.6428 894.5256 911.0534 948.2293 956.5331 968.9737 972.6171 1013.7516 1037.5245 1062.6989 1069.5925 1090.9704 1128.3473 1139.8789 1190.7611 1205.6290 1214.7101 1219.6410 1241.9466 1253.8927 1308.8200 1312.4011 1317.9350 1326.4806 1381.1061 1383.7616 1385.6816 1392.8065 1410.7453 1468.5529 1471.2728 1473.4632 1474.7911 1480.3282 1489.2983 1506.9156 1582.2586 1623.0081 1643.9323 2832.3095 2977.0757 2978.7506 2979.9608 2985.4510 3025.1748 3036.5750 3042.4547 3073.9511 3077.7245 3083.1642 3090.3958 3107.7334 3109.8557 3129.9176 3136.6905
redmass: 2.3934 3.8568 4.7057 4.0761 3.6926 3.6686 1.1504 1.1602 2.9187 2.8215 2.4063 2.3414 2.3928 2.0461 3.0331 3.7685 3.8024 3.7695 2.4779 6.6219 3.5971 3.2750 1.1635 3.0015 2.1460 1.2592 1.9825 1.4152 1.8543 2.0451 1.3586 2.3547 1.3815 2.8160 1.5112 2.0704 1.5538 2.7006 1.3167 2.1358 1.1058 1.3777 3.9294 1.8420 1.2576 1.2671 1.3213 1.4882 1.4673 1.2399 3.1492 1.3394 1.2037 1.2820 2.5924 1.0843 1.0434 1.0720 1.0633 1.0510 1.0935 2.5997 6.5094 6.4624 7.9009 1.0835 1.0391 1.0349 1.0561 1.0599 1.0896 1.1016 1.0985 1.0976 1.1001 1.1012 1.1001 1.0868 1.0870 1.0962 1.0973
irintensity: 0.3988 1.3779 2.6980 0.4446 5.4292 0.4768 0.1989 0.6716 1.1057 0.7372 2.9934 1.8621 4.8216 0.8242 0.0704 0.3239 6.9049 8.4140 23.3278 0.0177 0.8046 2.9514 2.9825 19.4508 22.4303 0.7772 20.3049 4.1742 61.5701 4.1966 0.7323 7.7562 0.0220 2.8233 3.2482 19.2532 1.5969 13.9658 9.3087 10.6395 0.3303 2.9631 0.0140 0.0678 0.2303 0.7254 1.2744 1.1899 1.4420 0.2517 0.6558 10.9940 10.4522 3.8194 4.5468 1.9515 14.5353 2.2185 8.4652 17.3051 9.0800 33.0448 0.0673 1.0105 222.0576 122.0275 26.4443 44.4804 23.4257 38.7890 1.5570 8.2907 22.3443 36.4569 61.5436 41.0841 19.0215 4.3713 24.5845 44.1262 1.4502
temp: 298.150 k
press: 1.00000 atm
elementType: 8 6 6 6 6 6 6 6 6 6 6 6 6 1 1 1 1 1 1 1 1 1 1 1 1 1 1 1 1
symmnumber: 1
zpe: 644849.9 jmol-1
zpe.correction: 0.245610 hartree
zpe.thermalcorrener: 0.258728 hartree
zpe.thermalcorrenthalpy: 0.259672 hartree
zpe.thermalcorrgfe: 0.204543 hartree
zpe.sumelectzpe: -541.111699 hartree
zpe.sumelectthermal: -541.098581 hartree
zpe.sumelectthermalent: -541.097637 hartree
zpe.sumelectthermalfe: -541.152766 hartree
dipole: 3.0311 1.9405 -0.4492
dipole: 3.6270
quadrupole: -91.4401 -75.8782 -80.8428
quadrupole: -9.7160 5.0278 -1.2753
quadrupole: -8.7198 6.8422 1.8776 -9.7160 5.0278 -1.2753
hfenergy: -541.357309 hartree
pointgroup: C01 [X(C12H16O1)]
dipole: 1.1378336 0.7509571 -0.4214406 debye
polarizability: 182.8160817|11.8662462|111.6726973|5.1594774|-16.9469469|100.4520941 unknown
InChI: InChI=1S/C12H16O/c1-3-11-4-6-12(7-5-11)8-10(2)9-13/h4-7,9-10H,3,8H2,1-2H3
charge 0 multiplicity 1
29 atoms
O  -4.729329 -1.17875 0.848493
C  -1.741241 -0.543243 -0.807977
C  -2.563722 -0.062014 0.440998
C  -0.239384 -0.398691 -0.610609
C  2.592824 -0.128532 -0.198799
C  0.468607 -1.306778 0.219798
C  0.493008 0.642455 -1.233671
C  -2.38993 1.456484 0.693897
C  1.858319 -1.173667 0.421147
C  1.885692 0.774548 -1.03152
C  4.084668 0.035721 0.056614
C  -4.033621 -0.366652 0.194021
C  4.376912 0.842662 1.350744
H  -1.993809 -1.603808 -1.002442
H  -2.067237 0.037777 -1.693095
H  -2.236745 -0.635365 1.328183
H  -0.072787 -2.131837 0.700419
H  -0.029383 1.349393 -1.890572
H  -2.768501 2.047541 -0.162566
H  -1.322055 1.700029 0.828875
H  -2.935751 1.775443 1.599549
H  2.385078 -1.89438 1.059474
H  2.43162 1.584567 -1.53141
H  4.563566 -0.959161 0.138969
H  4.558872 0.547892 -0.802216
H  -4.478659 0.208568 -0.664126
H  3.941555 1.856521 1.289479
H  5.465402 0.943381 1.516069
H  3.939132 0.342898 2.233871
