program: Gaussian 09
title: 000228981
version: EM64L-G09RevD.01
frameworkgroup: C1[X(C12H16O)]
method: RPBEPBE
basis: SDD
operation: Freq
keyword: #pfreq=noraman
keyword: PBEPBE/SDD
title: #p freq=noraman PBEPBE/SDD
converged: YES YES NO NO
title: Mulliken charges:
elementType: O C C C C C C C C C C C C H H H H H H H H H H H H H H H H
charge: -0.177440 -0.601877 -0.120001 0.394299 0.293933 -0.574874 -0.716629 0.447309 -0.406564 -0.408548 -0.832036 -0.088109 -0.817413 0.224256 0.216297 0.245726 0.237285 0.201221 0.257954 0.232135 0.227964 0.230572 0.234796 0.230815 0.230796 0.154597 0.235649 0.223517 0.224370
chargesum: 0.00000
title: Mulliken charges with hydrogens summed into heavy atoms:
elementType: O C C C C C C C C C C C C
charge: -0.177440 -0.161324 0.125725 0.394299 0.293933 -0.337590 -0.025319 0.447309 -0.178600 -0.177976 -0.135629 0.066487 -0.133877
polarizability: 1.71991967e+02 9.84557451e+00 1.36387050e+02 -8.70325582e+00 9.44552086e+00 8.56579372e+01
1716.lowfreq: -24.9623 -5.4049 0.0008 0.0008 0.0009 7.0433 16.6965 35.6151 40.2371
frequency: -24.5124 35.5006 40.1830 76.7607 88.0702 108.9154 148.3746 205.6055 234.8030 236.5315 268.1282 299.2382 320.7587 348.9352 363.2655 431.3851 454.6102 464.4121 518.2201 568.4185 617.0834 711.2888 734.0593 751.0186 821.2172 847.8463 890.6906 903.7527 904.2426 926.7180 952.2011 956.9556 994.5658 1007.6590 1040.1591 1047.6443 1066.0205 1090.3210 1128.3772 1141.4377 1167.9656 1206.4053 1224.0720 1253.3048 1258.0582 1293.4533 1318.6750 1321.0990 1368.6890 1383.3755 1391.9990 1398.5308 1402.9009 1410.5087 1463.1944 1472.0974 1473.2797 1473.5510 1476.8379 1479.9130 1484.5837 1500.0817 1584.0274 1623.9796 1643.9513 2833.2203 2973.3875 2973.7017 2976.6403 2983.8440 3030.5903 3044.5802 3048.6827 3054.1899 3073.9376 3082.8094 3082.9272 3090.0030 3103.7681 3112.8131 3137.7837
redmass: 1.0135 4.1815 6.1175 2.8968 3.6841 1.3389 1.9422 1.1663 2.7580 2.6622 2.7505 2.6739 2.9182 2.6748 2.3588 2.7934 3.1870 3.2375 3.5339 3.7627 4.2292 4.2253 3.5664 3.7839 1.3049 2.1727 1.9437 1.6152 1.4109 1.9798 2.0313 1.3470 1.8556 1.3398 1.5528 1.5501 1.7244 2.7769 2.1864 2.1832 1.5369 1.3839 1.7839 1.3707 2.8734 1.3512 1.3062 1.4480 4.9924 1.1900 1.2298 1.2312 1.2964 2.6899 1.0897 1.0750 1.0558 1.0546 1.0920 1.0594 1.0957 2.9097 5.8237 6.4925 7.8593 1.0835 1.0386 1.0385 1.0368 1.0588 1.0897 1.0979 1.0963 1.0951 1.0975 1.0991 1.0987 1.0998 1.0910 1.0870 1.0969
irintensity: 0.5859 2.8435 5.4949 1.5896 0.0304 1.4795 0.3523 0.4094 5.2198 0.7292 3.3958 0.4715 1.4862 0.2723 7.0067 1.3928 6.5847 0.9024 8.2993 5.0984 1.3419 0.2314 0.1715 2.5563 35.3486 3.6659 19.4725 42.4756 3.2513 5.6462 5.6924 0.1200 3.2505 2.2380 3.8860 22.9080 5.5550 15.7154 4.3949 9.1736 4.8048 1.0450 0.5804 0.7872 0.3281 0.2331 0.9889 0.5892 0.0879 12.0589 3.5247 11.4511 7.0587 4.1780 1.6547 0.4202 3.9211 18.0998 27.6585 25.7270 14.5084 27.6559 3.0389 7.5304 209.6734 120.0779 67.6056 1.3891 26.9942 28.2284 2.0681 22.6687 18.5983 22.7872 41.2889 0.7783 37.1754 19.1648 22.8565 13.1071 28.8142
temp: 298.150 k
press: 1.00000 atm
elementType: 8 6 6 6 6 6 6 6 6 6 6 6 6 1 1 1 1 1 1 1 1 1 1 1 1 1 1 1 1
symmnumber: 1
zpe: 642531.0 jmol-1
zpe.correction: 0.244727 hartree
zpe.thermalcorrener: 0.258247 hartree
zpe.thermalcorrenthalpy: 0.259191 hartree
zpe.thermalcorrgfe: 0.203697 hartree
zpe.sumelectzpe: -541.116479 hartree
zpe.sumelectthermal: -541.102959 hartree
zpe.sumelectthermalent: -541.102015 hartree
zpe.sumelectthermalfe: -541.157509 hartree
dipole: -2.9105 -1.4866 -0.4006
dipole: 3.2927
quadrupole: -93.4577 -72.2971 -79.6591
quadrupole: -4.3984 -3.1107 1.7989
quadrupole: -11.6531 9.5076 2.1455 -4.3984 -3.1107 1.7989
hfenergy: -541.3612059 hartree
pointgroup: C01 [X(C12H16O1)]
dipole: 1.0493653 0.7299778 -0.2100396 debye
polarizability: 168.1118271|15.6057697|138.1535108|9.7123437|-12.5732069|87.7716157 unknown
InChI: InChI=1S/C12H16O/c1-9-4-5-11(3)12(6-9)7-10(2)8-13/h4-6,8,10H,7H2,1-3H3
charge 0 multiplicity 1
29 atoms
O  -4.382994 -0.944738 0.109305
C  -1.151502 -0.169045 -0.887702
C  -2.161976 0.120959 0.28507
C  0.296943 -0.218527 -0.421716
C  0.850041 -1.40822 0.147043
C  1.110247 0.936428 -0.53803
C  -1.999491 1.555313 0.845181
C  2.457628 0.966848 -0.09996
C  2.195679 -1.375911 0.588366
C  2.988792 -0.212658 0.475366
C  0.046312 -2.693811 0.264223
C  -3.573756 -0.057924 -0.251994
C  3.308861 2.213904 -0.269572
H  -1.434131 -1.128758 -1.360862
H  -1.275304 0.62083 -1.654139
H  -2.005568 -0.618246 1.091622
H  0.679698 1.840203 -0.990243
H  -2.214476 2.313632 0.067364
H  -0.965134 1.711096 1.196357
H  -2.683639 1.730597 1.694439
H  2.630731 -2.281612 1.028604
H  4.026453 -0.22419 0.830868
H  -0.873091 -2.564598 0.864786
H  -0.271931 -3.068366 -0.727993
H  0.645905 -3.487728 0.741159
H  -3.857086 0.689043 -1.043796
H  3.792317 2.234699 -1.265894
H  2.704749 3.134508 -0.180749
H  4.113224 2.260269 0.485597
