program: Gaussian 09
title: 000228978
version: EM64L-G09RevD.01
frameworkgroup: C1[X(C13H24O)]
method: RPBEPBE
basis: SDD
operation: Freq
keyword: #pfreq=noraman
keyword: PBEPBE/SDD
title: #p freq=noraman PBEPBE/SDD
converged: YES YES NO NO
title: Mulliken charges:
elementType: O C C C C C C C C C C C C C H H H H H H H H H H H H H H H H H H H H H H H H
charge: -0.292434 -0.060031 0.007350 -0.033070 -0.483168 -0.461566 -0.472535 -0.453405 -0.405457 -0.408670 -0.411229 -0.388649 -0.383586 -0.512740 0.191527 0.232002 0.173419 0.211091 0.204424 0.188946 0.194826 0.198962 0.196495 0.195078 0.210343 0.192052 0.197072 0.192808 0.194027 0.192000 0.192773 0.190145 0.200338 0.194885 0.185717 0.231387 0.204141 0.194732
chargesum: 0.00000
title: Mulliken charges with hydrogens summed into heavy atoms:
elementType: O C C C C C C C C C C C C C
charge: -0.292434 0.131496 0.239352 0.140348 -0.067653 -0.077794 -0.077079 -0.047983 -0.016333 -0.021835 -0.026456 0.001835 -0.002984 0.117521
polarizability: 1.56441573e+02 -1.79927633e+00 1.37604237e+02 1.01059565e+00 1.17317833e+00 1.18645715e+02
1716.lowfreq: -14.1630 -0.0007 -0.0003 0.0001 12.0192 13.3464 48.7824 63.6463 76.8748
frequency: 47.8966 63.4914 76.7440 85.8218 124.0266 166.1206 192.1425 202.0583 219.4140 227.7191 278.5091 322.1827 324.4636 375.8863 402.5745 425.0022 432.5876 443.9754 482.9310 493.1815 519.4154 646.5951 765.1424 784.7856 787.4588 828.4855 836.5217 844.2258 870.6771 889.0554 890.0552 899.4077 919.6864 947.0772 950.3500 987.6860 1035.4970 1041.5365 1046.6583 1055.9718 1058.9657 1066.9991 1083.0172 1105.5427 1110.6207 1113.8372 1118.5316 1129.8343 1145.3143 1162.3580 1182.8880 1208.2514 1234.4311 1245.8080 1248.5616 1259.6500 1264.4243 1279.1225 1295.1175 1301.7545 1304.2627 1315.2386 1329.0857 1334.2001 1337.2532 1339.4802 1340.4264 1344.0790 1347.0139 1350.4082 1363.8588 1372.5356 1433.0661 1456.6809 1458.6359 1459.7164 1462.5071 1463.2402 1464.6999 1468.2586 1470.8630 1474.9078 1477.9742 1480.5283 2894.0971 2925.1254 2945.9728 2953.5218 2958.9531 2960.6229 2962.9475 2964.7438 2965.4278 2968.7372 2973.5434 2977.8914 2979.4475 3002.2941 3012.1131 3020.4487 3020.9711 3025.1615 3028.1443 3028.9525 3037.0682 3038.2148 3044.7967 3090.2360
redmass: 2.9144 2.1780 2.7546 2.5513 2.1805 2.1647 2.0153 2.0075 3.5477 1.9438 2.7655 1.8345 1.9628 2.7096 3.0650 3.0623 3.1551 2.7009 1.6662 2.7893 2.0352 2.5048 2.2934 1.5637 1.8652 2.4378 1.7498 1.9425 1.9372 1.7207 2.1161 1.5666 1.8803 2.2125 2.7612 2.4489 1.7597 1.7471 2.8915 1.9662 1.6584 1.0879 1.4857 2.2659 1.9469 1.6384 1.7279 1.8557 1.7726 1.8067 1.6980 1.5471 1.3411 1.2902 1.3515 1.2874 1.2951 1.3120 1.2017 1.2776 1.2645 1.2741 1.3597 1.3709 1.4272 1.4525 1.4558 1.4737 1.4680 1.4320 1.5134 1.4244 1.1263 1.0684 1.0913 1.0899 1.0903 1.0875 1.0881 1.0822 1.0829 1.0942 1.0774 1.0698 1.0815 1.0353 1.0803 1.0610 1.0602 1.0601 1.0625 1.0677 1.0625 1.0619 1.0630 1.0645 1.0772 1.1001 1.0977 1.1003 1.0949 1.1030 1.0952 1.0994 1.1020 1.1029 1.1032 1.0974
irintensity: 0.1044 3.3453 0.4058 0.9724 0.2866 1.0362 4.3195 1.9684 0.2501 0.4121 0.8645 1.0867 0.2168 2.1646 2.7776 1.0518 0.1109 0.3597 1.6104 3.0540 3.2540 0.0504 0.0236 0.3159 1.3870 4.9208 11.3776 3.8078 6.9525 19.9228 2.9466 2.2350 1.7034 1.7009 2.4195 7.4853 14.9960 19.1380 62.9882 36.1558 1.6654 0.2087 0.7494 1.3962 0.1100 0.4459 3.7847 0.5284 6.6857 8.6080 0.1326 1.1624 0.7561 1.4519 1.4461 2.3176 1.3720 1.2294 3.2298 2.0939 4.8244 4.9005 7.6914 0.4972 0.7233 0.5617 0.0287 0.4310 2.6998 4.6717 3.3074 1.8174 4.8710 6.2438 0.8969 4.6681 10.1689 3.2678 4.9554 20.9915 13.4944 4.1043 8.7730 7.6679 31.3674 82.0471 18.2499 39.6539 45.1370 32.2835 42.3648 16.9921 34.3110 38.8169 33.1320 30.2586 18.1112 80.2265 103.4573 14.1969 77.1823 4.4691 59.0197 63.6579 12.6061 155.3948 112.2899 33.1350
temp: 298.150 k
press: 1.00000 atm
elementType: 8 6 6 6 6 6 6 6 6 6 6 6 6 6 1 1 1 1 1 1 1 1 1 1 1 1 1 1 1 1 1 1 1 1 1 1 1 1
symmnumber: 1
zpe: 909020.7 jmol-1
zpe.correction: 0.346228 hartree
zpe.thermalcorrener: 0.360803 hartree
zpe.thermalcorrenthalpy: 0.361748 hartree
zpe.thermalcorrgfe: 0.304980 hartree
zpe.sumelectzpe: -583.849136 hartree
zpe.sumelectthermal: -583.834560 hartree
zpe.sumelectthermalent: -583.833616 hartree
zpe.sumelectthermalfe: -583.890383 hartree
dipole: 1.0249 0.0157 1.1202
dipole: 1.5183
quadrupole: -86.5282 -85.2945 -89.7135
quadrupole: 1.7720 1.4744 2.1473
quadrupole: 0.6505 1.8842 -2.5348 1.7720 1.4744 2.1473
hfenergy: -584.1953638 hartree
pointgroup: C01 [X(C13H24O1)]
dipole: -0.4037262 -0.0037358 0.4402603 debye
polarizability: 156.1869464|-2.7844399|137.924639|-1.134227|-0.2430443|118.5799405 unknown
InChI: InChI=1S/C13H24O/c1-14-13-10-6-5-9-12(13)11-7-3-2-4-8-11/h11-13H,2-10H2,1H3
charge 0 multiplicity 1
38 atoms
O  -1.383443 -1.766645 -0.713523
C  -0.500431 0.472819 -0.388768
C  0.944843 -0.10503 -0.271106
C  -1.584638 -0.532441 0.074427
C  -0.700069 1.82679 0.348226
C  1.96982 0.729661 -1.084026
C  1.448891 -0.276936 1.187173
C  -3.011171 0.032585 -0.120925
C  -2.120736 2.401194 0.143344
C  3.377632 0.086712 -1.05618
C  2.851731 -0.93205 1.223842
C  -3.191289 1.387221 0.605104
C  3.873869 -0.117302 0.395564
C  -2.09122 -2.930963 -0.18971
H  -0.689102 0.646782 -1.472079
H  0.90516 -1.115838 -0.727105
H  -1.436422 -0.767962 1.156476
H  0.056106 2.554333 -0.002776
H  -0.527133 1.688973 1.435073
H  2.038628 1.756263 -0.666547
H  1.620055 0.832322 -2.131347
H  0.736538 -0.890193 1.774224
H  1.506612 0.713873 1.683436
H  -3.764612 -0.692828 0.242924
H  -3.18144 0.164573 -1.208374
H  -2.274844 2.631169 -0.931116
H  -2.230095 3.354157 0.696875
H  4.095856 0.712757 -1.621675
H  3.336686 -0.897696 -1.567215
H  2.784109 -1.959217 0.808646
H  3.20027 -1.031042 2.270949
H  -3.103023 1.236492 1.701511
H  -4.209324 1.780361 0.418934
H  4.859608 -0.622867 0.39675
H  4.020728 0.874087 0.873325
H  -1.742874 -3.792055 -0.783249
H  -3.192087 -2.84277 -0.296867
H  -1.850291 -3.102985 0.882079
