program: Gaussian 09
title: 000228974
version: EM64L-G09RevD.01
frameworkgroup: C1[X(C15H28O)]
method: RPBEPBE
basis: SDD
operation: Freq
keyword: #pfreq=noraman
keyword: PBEPBE/SDD
title: #p freq=noraman PBEPBE/SDD
converged: YES YES NO NO
title: Mulliken charges:
elementType: O C C C C C C C C C C C C C C C H H H H H H H H H H H H H H H H H H H H H H H H H H H H
charge: -0.215892 -0.143178 -0.143227 -0.031725 -0.506370 -0.506356 0.297257 0.297262 0.110843 -0.746971 -0.740958 -0.757743 -0.744276 -0.744346 -0.757748 -0.740919 0.205392 0.205416 0.198234 0.221451 0.219806 0.219788 0.221479 0.216657 0.213295 0.216658 0.205656 0.216584 0.211654 0.209227 0.200130 0.265496 0.197280 0.203683 0.258350 0.258471 0.203658 0.197271 0.265387 0.200163 0.209279 0.211632 0.216595 0.205654
chargesum: 0.00000
title: Mulliken charges with hydrogens summed into heavy atoms:
elementType: O C C C C C C C C C C C C C C C
charge: -0.215892 0.062215 0.062189 0.166508 -0.065112 -0.065089 0.297257 0.297262 0.110843 -0.100361 -0.107064 -0.082889 -0.084963 -0.084946 -0.082920 -0.107038
polarizability: 1.77788506e+02 1.20853237e-03 1.66320924e+02 5.95973364e-04 -1.35889286e+00 1.37624876e+02
1716.lowfreq: -8.9112 -0.0007 -0.0006 -0.0005 15.6403 18.3318 44.5204 65.7307 95.5148
frequency: 44.4327 65.6557 95.4727 101.2524 115.8601 140.0768 173.6026 190.3090 190.5179 216.8481 223.4787 230.9087 245.3071 250.6088 252.0191 266.3339 267.1640 284.2828 304.5963 316.4333 329.1089 332.8655 374.4829 390.2283 392.5472 414.7558 428.4362 457.5612 473.6223 490.8233 515.9236 667.4933 720.5722 727.7685 776.4885 799.9110 852.6554 863.8960 878.0795 919.4547 924.5548 927.5340 927.7297 933.2892 939.0813 947.4939 947.7603 983.1316 1007.5919 1010.9018 1020.6098 1028.0520 1046.7275 1046.8452 1067.5590 1093.6271 1095.6891 1099.2355 1154.3439 1197.2466 1204.5898 1216.5190 1224.0724 1243.7546 1244.3718 1250.6309 1277.2700 1278.7007 1282.5681 1298.5342 1329.7900 1336.2777 1339.3455 1344.8064 1373.4639 1374.4768 1375.3472 1375.9156 1384.3722 1400.7597 1401.7715 1455.1538 1458.3091 1458.7636 1464.2611 1468.7660 1471.6001 1473.2935 1475.0917 1477.0963 1478.0085 1486.0242 1486.1306 1488.9958 1490.2538 1504.4443 1506.3870 1618.5748 2927.2968 2941.4316 2946.2331 2963.7550 2963.9354 2967.8516 2968.9132 2969.5296 2977.5866 2978.6892 2979.3588 2984.6001 3042.8421 3047.2788 3053.2464 3053.6592 3058.9328 3059.1963 3061.8902 3061.9492 3064.4184 3067.8134 3068.8072 3069.1323 3097.5935 3097.8958 3102.9671 3103.1083
redmass: 3.2323 2.4221 3.3221 2.2016 3.1804 2.7284 1.9330 1.3957 1.4405 1.0560 1.6764 1.2795 1.6532 1.5081 1.9238 1.4875 1.2139 1.7818 2.4111 2.8191 3.7503 2.4401 2.2835 2.5102 2.6768 2.5823 2.1006 2.4702 2.8949 2.7563 2.3952 3.2171 3.4032 4.0499 3.3382 3.3783 2.3016 1.9312 1.8798 1.9087 1.6967 1.6180 1.6485 1.5588 1.7487 1.2306 1.2292 2.2925 1.8991 1.5723 1.3927 1.5184 1.8567 1.8266 2.0285 2.3059 1.1146 2.5776 1.8162 2.0565 2.2043 2.1873 2.8326 2.4659 1.8250 2.2810 1.3194 1.4331 1.6405 1.2547 1.4769 1.5791 1.5850 1.5334 1.1945 1.1973 1.1987 1.2012 1.2126 1.2068 1.2129 1.0816 1.0508 1.0510 1.0664 1.0509 1.0638 1.0507 1.0488 1.0571 1.0521 1.0526 1.0641 1.0561 1.0561 1.0569 1.0600 8.1661 1.0801 1.0808 1.0815 1.0360 1.0360 1.0362 1.0374 1.0375 1.0486 1.0385 1.0481 1.0594 1.1016 1.1016 1.0988 1.0988 1.0985 1.0985 1.0985 1.0983 1.0989 1.0987 1.0978 1.0985 1.0981 1.0981 1.0984 1.0983
irintensity: 0.2563 0.0012 1.0330 0.0229 0.1132 1.6376 0.9426 0.0003 0.8539 0.0265 0.0619 0.1676 1.0288 0.0949 0.1216 1.4703 0.1829 1.3065 0.0067 0.1856 8.8593 0.5469 0.0406 0.2611 0.6519 0.1364 0.0687 0.4822 0.5294 0.4438 0.0635 3.2454 2.6062 2.8374 0.1197 1.2742 4.8859 52.9705 2.4923 3.4593 1.6247 2.6309 1.8654 0.9822 4.1931 0.5395 1.5498 3.0686 1.8347 0.9976 1.9134 1.1600 1.7762 1.3296 51.9351 6.4004 0.5592 1.8298 14.7821 4.2349 0.4178 1.1302 2.5209 57.7117 3.1182 15.5073 13.4332 2.7800 0.3250 7.4788 12.3030 0.6728 21.5339 1.1729 7.2823 47.2311 1.7081 59.7188 9.3831 33.0046 18.3609 1.3646 0.0682 3.9540 4.7255 0.9999 2.7259 0.0110 0.3963 9.7349 17.3336 2.9260 27.6635 1.5562 10.3596 33.7294 21.5477 88.4469 9.6669 15.7450 22.2088 13.9751 36.4403 39.5062 4.4527 87.4086 0.9066 6.8268 82.9630 47.5818 17.5188 18.5150 4.9975 5.8264 15.9424 43.9317 82.7990 62.3541 30.5331 84.3980 139.8275 1.3210 11.2202 8.6443 22.0593 14.3454
temp: 298.150 k
press: 1.00000 atm
elementType: 8 6 6 6 6 6 6 6 6 6 6 6 6 6 6 6 1 1 1 1 1 1 1 1 1 1 1 1 1 1 1 1 1 1 1 1 1 1 1 1 1 1 1 1
symmnumber: 1
zpe: 1038832.6 jmol-1
zpe.correction: 0.395670 hartree
zpe.thermalcorrener: 0.414989 hartree
zpe.thermalcorrenthalpy: 0.415933 hartree
zpe.thermalcorrgfe: 0.350793 hartree
zpe.sumelectzpe: -662.310929 hartree
zpe.sumelectthermal: -662.291610 hartree
zpe.sumelectthermalent: -662.290666 hartree
zpe.sumelectthermalfe: -662.355806 hartree
dipole: 0.0000 2.3213 -1.7328
dipole: 2.8967
quadrupole: -101.1343 -104.6866 -103.8596
quadrupole: -0.0009 -0.0016 2.4072
quadrupole: 2.0926 -1.4598 -0.6328 -0.0009 -0.0016 2.4072
hfenergy: -662.7065992 hartree
pointgroup: C01 [X(C15H28O1)]
dipole: 0.0000357 -0.9252518 -0.6653938 debye
polarizability: 177.7885061|0.0009283|166.3601679|0.0023246|0.8478828|137.5856326 unknown
InChI: InChI=1S/C15H28O/c1-10-8-11(14(2,3)4)13(16)12(9-10)15(5,6)7/h10-12H,8-9H2,1-7H3
charge 0 multiplicity 1
44 atoms
O  0.000027 1.481131 1.104368
C  -1.291799 -0.090101 -0.297333
C  1.291893 -0.090178 -0.297207
C  -0.000069 -2.32997 -0.202185
C  -1.272774 -1.564017 0.234496
C  1.272714 -1.564146 0.234504
C  -2.631489 0.690202 -0.041356
C  2.631576 0.690047 -0.040969
C  0.00004 0.563253 0.238441
C  -0.000145 -3.771408 0.353973
C  -3.780957 -0.019812 -0.813093
C  -3.004793 0.758096 1.464596
C  -2.500401 2.132705 -0.607495
C  2.499751 2.133275 -0.605075
C  3.005764 0.756003 1.464852
C  3.780774 -0.018628 -0.814344
H  -1.168534 -0.158364 -1.402226
H  1.16875 -0.158296 -1.402123
H  -0.000069 -2.384011 -1.313179
H  -1.32669 -1.556606 1.341702
H  -2.169087 -2.098235 -0.130588
H  2.168961 -2.098431 -0.130635
H  1.326661 -1.55682 1.341709
H  0.893375 -4.331269 0.02044
H  -0.000144 -3.764586 1.461132
H  -0.893723 -4.331176 0.020442
H  -3.539251 -0.128613 -1.888502
H  -4.708165 0.578153 -0.735196
H  -4.00197 -1.023215 -0.405784
H  -3.167719 -0.249401 1.890839
H  -3.946237 1.326212 1.589718
H  -2.212693 1.262059 2.041821
H  -2.217319 2.115882 -1.678556
H  -3.468415 2.6620 -0.52403
H  -1.743864 2.711882 -0.053719
H  1.743242 2.711426 -0.050177
H  3.467611 2.662798 -0.521298
H  2.216206 2.117824 -1.676034
H  2.213923 1.259043 2.043227
H  3.947189 1.324111 1.590168
H  3.169116 -0.252041 1.889639
H  4.002429 -1.022439 -0.408397
H  4.70782 0.579574 -0.736349
H  3.538383 -0.126213 -1.889721
