program: Gaussian 09
title: 000228960
version: EM64L-G09RevD.01
frameworkgroup: C1[X(C14H13Cl6NO2)]
method: RPBEPBE
basis: SDD
operation: Freq
keyword: #p
keyword: freq=noraman
keyword: PBEPBE/SDD
title: #p freq=noraman PBEPBE/SDD
converged: NO YES NO NO
title: Mulliken charges:
elementType: Cl Cl Cl Cl Cl Cl O O N C C C C C C C C C C C C C C H H H H H H H H H H H H H
charge: 0.101155 0.101062 0.140521 0.114149 0.084448 0.084549 -0.169689 -0.169589 -0.154624 -0.246765 -0.246472 -0.169355 -0.169662 -0.491623 -0.008637 -0.008355 0.129353 0.129601 -0.372865 -0.353241 -0.343408 -0.361227 -0.693666 0.358627 0.358305 0.243947 0.243854 0.218404 0.219022 0.193417 0.193827 0.201216 0.201273 0.219317 0.211499 0.211632
chargesum: 0.00000
title: Mulliken charges with hydrogens summed into heavy atoms:
elementType: Cl Cl Cl Cl Cl Cl O O N C C C C C C C C C C C C C C
charge: 0.101155 0.101062 0.140521 0.114149 0.084448 0.084549 -0.169689 -0.169589 -0.154624 0.111862 0.111833 -0.169355 -0.169662 -0.491623 -0.008637 -0.008355 0.129353 0.129601 0.114936 0.084184 0.043837 0.041261 -0.051218
polarizability: 2.35391154e+02 -1.70528891e-02 2.18161460e+02 -1.10250177e+01 -5.06884744e-02 1.77037055e+02
1716.lowfreq: -9.8745 -8.6143 -3.6214 0.0024 0.0027 0.0037 16.5837 23.3923 44.3781
frequency: 16.5338 22.8716 44.3139 50.2646 71.2009 87.5469 90.2494 92.7929 113.7555 113.8825 123.1614 130.1871 134.3693 147.7250 152.8039 154.1874 165.8806 180.4908 217.2958 238.5662 257.9942 269.5414 279.3119 281.4295 311.1641 340.5013 341.3922 351.1084 366.1005 404.9324 457.4464 458.0441 515.6912 556.5942 588.0241 601.8323 615.3691 620.5876 671.8384 687.9922 717.3793 732.5538 759.5344 772.7166 788.1865 832.3225 833.0077 850.6416 876.6446 896.6963 944.9832 961.4450 970.5038 1002.9177 1009.4636 1014.0435 1042.5550 1048.2294 1053.9593 1075.1029 1076.6267 1085.6857 1118.9088 1129.8739 1147.5648 1193.3714 1202.6727 1235.0791 1240.9997 1252.7363 1257.1860 1263.3349 1287.3737 1291.6501 1313.8229 1326.2574 1337.2639 1353.2511 1370.0078 1393.1971 1449.3639 1467.4863 1470.8530 1480.0974 1480.4831 1489.2190 1597.8014 1631.5646 1694.8163 2958.3701 2971.7651 2974.8724 2987.8988 2999.1968 3017.9612 3026.0737 3049.0569 3071.2677 3074.5552 3075.3334 3083.6155 3088.2488
redmass: 5.3878 5.9364 1.7359 9.6424 9.8639 14.5428 2.7136 9.8288 5.1075 11.9571 2.8942 7.5162 8.0510 29.8083 8.6012 33.4844 20.6619 16.1172 10.4454 1.1068 13.0015 4.8124 4.3519 6.7192 19.4387 26.5874 6.0525 20.9261 6.8144 5.8530 7.3011 4.8007 7.3540 7.3580 9.8426 8.0187 11.6723 12.0635 6.7954 6.6864 3.9553 1.0936 1.2593 7.7224 7.5328 6.8233 1.4418 8.2737 4.6779 1.9439 1.9885 3.8107 2.5445 4.6053 3.5875 2.3850 4.5659 5.0671 4.9183 2.6411 3.4513 4.9681 2.4892 2.9496 4.6660 1.9527 1.8068 1.4257 1.6196 1.2797 1.5641 1.6884 1.2272 1.0489 1.7088 2.7310 1.3656 1.5707 1.5203 1.2146 1.0929 1.0684 1.0729 1.0430 1.0701 1.0878 12.0267 12.4565 11.5052 1.0586 1.0589 1.0367 1.0589 1.0990 1.0579 1.1027 1.1041 1.1009 1.0852 1.0992 1.0859 1.1064
irintensity: 0.0120 0.1284 0.0143 0.1998 0.0249 0.0007 0.1335 0.2848 0.0206 5.6906 0.0276 0.0151 1.3278 0.1855 0.3484 0.0129 0.0045 2.0799 0.2019 0.0001 1.6964 0.6808 2.4986 2.3807 1.3111 0.0004 1.7331 0.5833 0.4455 24.7734 0.3038 2.5821 38.1466 0.6541 1.1181 3.6493 35.4325 14.1209 41.4241 12.3534 5.7864 15.6578 5.8211 70.1001 7.0077 40.7966 13.7142 5.3166 0.2674 8.0400 7.7992 0.1151 7.7206 2.5371 4.7663 3.0389 8.6627 47.0912 39.3893 6.1061 22.0027 15.5969 6.6099 91.8797 0.0179 20.2471 1.8259 35.7530 19.1648 3.8958 40.3453 7.4312 5.8219 2.1437 49.1846 137.7296 27.9339 0.4832 23.9608 10.7104 18.7146 0.4516 1.3565 12.3980 5.8084 21.1763 50.4133 443.5037 32.9718 10.9288 48.0506 36.9453 25.9009 1.2573 28.6510 11.8666 20.6940 74.7789 0.0303 46.2814 1.8178 10.9956
temp: 298.150 k
press: 1.00000 atm
elementType: 17 17 17 17 17 17 8 8 7 6 6 6 6 6 6 6 6 6 6 6 6 6 6 1 1 1 1 1 1 1 1 1 1 1 1 1
symmnumber: 1
zpe: 643140.1 jmol-1
zpe.correction: 0.244959 hartree
zpe.thermalcorrener: 0.269195 hartree
zpe.thermalcorrenthalpy: 0.270139 hartree
zpe.thermalcorrgfe: 0.188280 hartree
zpe.sumelectzpe: -3505.115632 hartree
zpe.sumelectthermal: -3505.091397 hartree
zpe.sumelectthermalent: -3505.090452 hartree
zpe.sumelectthermalfe: -3505.172311 hartree
dipole: -1.5793 0.0006 -0.9012
dipole: 1.8183
quadrupole: -170.9523 -192.2873 -170.3577
quadrupole: -0.0143 -3.6919 0.0531
quadrupole: 6.9135 -14.4215 7.5081 -0.0143 -3.6919 0.0531
hfenergy: -3505.3605912 hartree
pointgroup: C01 [X(C14H13Cl6N1O2)]
dipole: -0.6252086 -0.0134801 0.3474348 debye
polarizability: 235.1405699|-0.3394032|218.1161577|11.6615157|1.3627649|177.3329407 unknown
InChI: InChI=1S/C14H13Cl6NO2/c1-2-3-4-5-21-10(22)6-7(11(21)23)13(18)9(16)8(15)12(6,17)14(13,19)20/h6-7H,2-5H2,1H3
charge 0 multiplicity 1
36 atoms
Cl 2.569767 2.873097 -0.154153
Cl 2.58321 -2.838548 -0.333503
Cl 4.048975 0.068121 -1.749162
Cl 4.211362 -0.025309 1.23724
Cl 0.076516 1.847633 -2.232048
Cl 0.088403 -1.696336 -2.346312
O  -0.686968 2.304104 1.487702
O  -0.679224 -2.386223 1.341079
N  -0.980134 -0.04144 1.409949
C  1.26313 0.750054 1.264172
C  1.265881 -0.814468 1.214763
C  1.950402 1.15489 -0.097435
C  1.956278 -1.130043 -0.169501
C  3.03781 0.017264 -0.207143
C  1.026986 0.726354 -1.247539
C  1.031235 -0.634433 -1.291286
C  -0.214745 1.149751 1.390905
C  -0.210924 -1.226534 1.315442
C  -2.454738 -0.045429 1.490398
C  -3.112392 -0.01395 0.092142
C  -4.653706 -0.00608 0.191615
C  -5.34079 0.015487 -1.192833
C  -6.881262 0.028541 -1.09344
H  1.846524 1.163607 2.101433
H  1.850279 -1.277786 2.024832
H  -2.751534 -0.960081 2.034205
H  -2.752973 0.842619 2.07594
H  -2.767899 0.886703 -0.452098
H  -2.77896 -0.89707 -0.486571
H  -4.994992 -0.900615 0.753198
H  -4.984032 0.878027 0.775773
H  -4.996799 0.906055 -1.756667
H  -5.013156 -0.868899 -1.775862
H  -7.35022 0.04059 -2.094094
H  -7.251931 -0.865532 -0.557525
H  -7.236176 0.92048 -0.543513
