program: Gaussian 09
title: 000228946
version: EM64L-G09RevD.01
frameworkgroup: C1[X(C11H4Cl6O2)]
method: RPBEPBE
basis: SDD
operation: Freq
keyword: #p
keyword: freq=noraman
keyword: PBEPBE/SDD
title: #p freq=noraman PBEPBE/SDD
converged: YES YES NO NO
title: Mulliken charges:
elementType: Cl Cl Cl Cl Cl Cl O O C C C C C C C C C C C H H H H
charge: 0.079049 0.079049 0.122924 0.118253 0.066657 0.066656 -0.402419 -0.402418 -0.336373 -0.336372 -0.478349 0.418971 0.418963 -0.015328 -0.015327 0.080625 0.080629 -0.360818 -0.360817 0.223659 0.223657 0.364565 0.364565
chargesum: 0.00000
title: Mulliken charges with hydrogens summed into heavy atoms:
elementType: Cl Cl Cl Cl Cl Cl O O C C C C C C C C C C C
charge: 0.079049 0.079049 0.122924 0.118253 0.066657 0.066656 -0.037854 -0.037854 -0.336373 -0.336372 -0.478349 0.418971 0.418963 -0.015328 -0.015327 0.080625 0.080629 -0.137159 -0.137160
polarizability: 1.95588098e+02 -1.06236867e-03 2.03028674e+02 -1.32669615e+00 2.87513444e-05 1.35459143e+02
1716.lowfreq: -6.7541 -5.1421 0.0011 0.0026 0.0028 3.2458 59.3668 64.1274 79.8202
frequency: 59.3656 64.1269 79.8122 80.1942 118.3374 126.3063 146.2894 151.6349 153.9041 154.2490 164.7992 166.1240 235.5463 267.6403 275.3924 278.4909 306.2609 313.3075 327.8145 336.9938 350.9494 362.9700 378.4949 428.1353 473.4835 485.2203 508.6164 567.9373 570.4173 618.7994 650.2217 662.9250 669.1430 709.3232 742.6431 762.9108 781.9976 842.2921 860.0955 894.4940 898.0825 900.2464 985.9845 1020.4376 1043.6203 1088.8769 1106.4971 1125.0702 1163.3963 1194.9420 1239.5555 1253.1028 1255.0958 1391.3771 1431.5434 1480.8426 1605.5028 1636.4113 1636.5984 3120.0937 3142.4325 3576.7790 3577.8560
redmass: 9.6659 9.8276 18.2908 22.4452 29.1402 7.0820 30.8086 31.8339 29.1303 20.0734 14.1219 18.5266 13.7401 11.8556 5.8402 10.3305 1.1021 1.3142 9.6967 24.3976 29.2305 5.3976 9.5827 9.6926 7.9541 6.3970 5.8335 4.8068 6.4630 7.9628 9.3095 8.5685 8.8039 9.6263 10.1150 10.7687 1.5453 12.2139 10.4082 10.1258 1.3540 8.5400 11.8672 4.0922 8.1178 7.2763 6.9057 2.4608 1.2230 2.1807 1.9505 5.8864 2.0449 4.4742 5.3199 3.1194 11.9869 7.1950 7.8015 1.0867 1.0969 1.0662 1.0664
irintensity: 3.2803 0.0726 1.0690 0.1748 0.1135 1.8961 0.0386 0.2228 0.0854 0.7884 2.5731 0.7125 1.9371 4.1857 37.1697 0.2375 0.0927 199.2154 11.3690 1.2046 0.1513 0.0070 4.1541 0.9659 9.7537 18.3944 3.2040 68.0890 6.3265 0.8916 21.4611 65.1228 7.9619 75.5867 0.9434 81.0066 59.0602 43.0242 0.0233 6.8723 0.0301 0.1149 44.9183 13.7326 0.7973 2.4085 185.9500 142.3482 0.1888 36.4620 129.2004 27.3853 160.1076 1.9883 7.1848 164.8007 52.2427 14.6334 11.3519 12.3120 13.9119 71.9016 18.0263
temp: 298.150 k
press: 1.00000 atm
elementType: 17 17 17 17 17 17 8 8 6 6 6 6 6 6 6 6 6 6 6 1 1 1 1
symmnumber: 1
zpe: 317022.4 jmol-1
zpe.correction: 0.120747 hartree
zpe.thermalcorrener: 0.139246 hartree
zpe.thermalcorrenthalpy: 0.140190 hartree
zpe.thermalcorrgfe: 0.073942 hartree
zpe.sumelectzpe: -3330.947205 hartree
zpe.sumelectthermal: -3330.928706 hartree
zpe.sumelectthermalent: -3330.927762 hartree
zpe.sumelectthermalfe: -3330.994010 hartree
dipole: 6.4858 0.0005 -2.5788
dipole: 6.9797
quadrupole: -121.3054 -146.0615 -152.7705
quadrupole: 0.0018 -6.5218 -0.0007
quadrupole: 18.7404 -6.0157 -12.7247 0.0018 -6.5218 -0.0007
hfenergy: -3331.0679523 hartree
pointgroup: C01 [X(C11H4Cl6O2)]
dipole: 2.647245 -0.0013295 0.7298666 debye
dipolederiv: -0.1176352 -0.0988801 -0.0227455 -0.0877705 -0.4565657 -0.123002 -0.0258773 -0.1442052 -0.1147181 -0.1174405 0.0985221 -0.0226369 0.0874109 -0.4567078 0.1230926 -0.0257431 0.144299 -0.1147712 -0.712169 0.0003283 -0.1261363 0.0003287 -0.055159 0.0000522 -0.1029963 0.0000401 -0.185785 -0.3095095 0.000154 0.2391953 0.0001503 -0.0590622 -0.0001818 0.2131147 -0.0001692 -0.6340531 -0.0841792 -0.1528717 0.1940054 -0.1622754 -0.2780896 0.2551947 0.2783353 0.3432166 -0.3639154 -0.0838465 0.1527032 0.1937057 0.1621263 -0.2785403 -0.2554164 0.2779425 -0.3435273 -0.3637997 -0.0579098 0.0797402 0.0317457 0.3438444 -1.3290988 0.0463542 0.0328936 0.0446729 -0.363472 -0.058357 -0.0810832 0.0317081 -0.3451835 -1.3286705 -0.0461484 0.0329247 -0.0444707 -0.3634505 0.2445353 0.1072812 0.1095675 0.1009756 0.7239098 0.2269299 0.1120657 0.2737463 0.1206013 0.244322 -0.1067607 0.1093486 -0.1004556 0.7240308 -0.2271627 0.1117954 -0.2739842 0.1206993 1.1813849 -0.0006598 -0.0905083 -0.0006614 -0.0752952 0.0001558 -0.123736 0.0001739 1.0139664 0.0062002 0.2708526 0.0201543 -0.1546931 -0.2938798 -0.0731491 -0.0400442 -0.0094175 -0.1304651 0.0060716 -0.2711671 0.0202906 0.1543657 -0.293741 0.0731689 -0.0400708 0.0095036 -0.130479 -0.0678565 0.1535694 -0.3020917 0.2174564 0.2214161 -0.4824034 -0.2993049 -0.5406773 0.3257473 -0.0682569 -0.153322 -0.3015529 -0.2172098 0.2220059 0.4827416 -0.2986933 0.5410157 0.3255488 -0.1520317 -0.0672248 -0.0121567 -0.4220787 1.2560453 -0.0538545 -0.0108197 -0.0414491 0.0496111 -0.1515089 0.0687162 -0.0121157 0.423572 1.2555523 0.0535637 -0.0108806 0.0411526 0.0495862 0.1287371 -0.2145603 0.0422552 0.3194026 -0.1571908 0.0363583 0.0289339 -0.0209292 -0.1392552 0.1286257 0.2142702 0.0421647 -0.3196981 -0.1570837 -0.0363969 0.0290341 0.0209034 -0.1392513 -0.0411906 0.0810086 -0.0319744 0.1053025 0.0013294 0.0176092 -0.0304701 0.0158824 0.1577892 -0.0413879 -0.0809722 -0.0319729 -0.1052675 0.0015147 -0.017537 -0.0304613 -0.0158099 0.1577966 0.0616678 0.0136711 -0.0401319 -0.0805858 0.4066744 -0.0041502 -0.0389679 -0.0039181 0.3610352 0.0617346 -0.0133151 -0.0401176 0.0809439 0.4066059 0.0041811 -0.0389743 0.0039512 0.3610342 unknown
polarizability: 195.1590674|0.0040562|203.0286713|-5.2319547|-0.0052139|135.8881762 unknown
InChI: InChI=1S/C11H4Cl6O2/c12-7-8(13)10(15)6-4(19)2-1-3(18)5(6)9(7,14)11(10,16)17/h1-2,18-19H
charge 0 multiplicity 1
23 atoms
Cl -1.085001 -2.848778 -0.792161
Cl -1.082025 2.849818 -0.79273
Cl -3.026854 0.001443 -1.573404
Cl -0.332937 -0.000076 -2.859066
Cl -2.116229 -1.780415 2.266736
Cl -2.114352 1.783143 2.266385
O  1.880257 -2.838113 0.174123
O  1.883261 2.836245 0.173427
C  -0.730312 -1.145175 -0.237222
C  -0.729117 1.145954 -0.237454
C  -1.211086 0.00054 -1.224466
C  0.740047 -0.713318 -0.059006
C  0.740794 0.712602 -0.059162
C  -1.48892 -0.678376 1.032091
C  -1.488208 0.680201 1.031955
C  1.923684 -1.439478 0.141334
C  1.925201 1.437556 0.140988
C  3.128746 -0.7044 0.321227
C  3.129487 0.701246 0.321052
H  4.073224 -1.239875 0.479223
H  4.074528 1.235768 0.478915
H  2.7871 -3.216916 0.289865
H  2.790512 3.214106 0.289051
