program: Gaussian 09
title: 000228930
version: EM64L-G09RevD.01
frameworkgroup: C1[X(C7H14N2O2)]
method: RPBEPBE
basis: SDD
operation: Freq
keyword: #p
keyword: freq=noraman
keyword: PBEPBE/SDD
title: #p freq=noraman PBEPBE/SDD
converged: YES YES NO NO
title: Mulliken charges:
elementType: O O N N C C C C C C C H H H H H H H H H H H H H H
charge: -0.317728 -0.306561 -0.068999 -0.140606 -0.357486 -0.358460 -0.374539 -0.377434 -0.613539 0.304988 -0.489669 0.214935 0.189031 0.192382 0.216014 0.253410 0.218349 0.222913 0.252340 0.224081 0.224845 0.189873 0.224073 0.239118 0.238669
chargesum: 0.00000
title: Mulliken charges with hydrogens summed into heavy atoms:
elementType: O O N N C C C C C C C
charge: -0.317728 -0.306561 -0.068999 -0.140606 0.046480 0.049936 0.097219 0.097819 0.025260 0.304988 0.212191
polarizability: 1.23333062e+02 -2.36020593e-02 9.23401442e+01 3.62167704e+00 -1.27719274e+00 7.22692805e+01
1716.lowfreq: -0.0007 0.0003 0.0008 7.7955 9.8822 30.1416 42.1182 85.6195 99.9101
frequency: 42.0246 85.6189 99.7894 143.0001 147.8903 168.4529 230.3676 253.3739 302.3678 322.0693 323.2943 349.3068 402.7016 472.2612 501.7456 549.0861 625.5861 690.3860 741.2945 749.2779 840.4810 896.7533 939.4352 1005.0885 1010.4106 1051.3616 1064.6289 1067.9091 1088.2105 1118.6776 1128.0227 1146.4427 1148.5815 1166.9974 1199.1329 1223.7044 1248.6347 1285.8258 1288.6638 1332.9910 1351.7412 1360.4533 1369.7375 1397.5206 1431.3462 1440.0644 1449.7546 1454.8641 1459.1156 1461.8611 1465.3624 1471.5393 1474.3610 1481.7527 1647.0717 2846.4898 2851.8807 2869.2406 2980.3059 2983.3601 2999.9514 3020.7625 3031.6638 3036.6251 3078.4397 3095.7410 3100.1780 3120.0891 3138.0603
redmass: 3.6712 1.1525 5.2246 2.8527 2.9975 3.0734 1.2881 1.8454 2.3096 3.2382 3.2498 2.9201 2.0244 2.6903 4.5323 3.8788 2.4243 11.2126 4.4981 3.5600 1.5768 3.7333 2.2832 2.4671 3.4684 1.6865 2.0122 2.0237 1.8694 1.2538 1.7804 1.4541 2.4815 2.5126 1.0892 1.8073 3.8754 1.5923 1.4492 1.2560 1.3444 1.3460 1.4701 1.8466 1.1700 1.4204 1.0528 1.0796 1.0784 1.0818 1.1021 1.0620 1.0991 1.0525 9.3157 1.0704 1.0653 1.0608 1.0684 1.0678 1.0295 1.0734 1.0884 1.0903 1.1010 1.0957 1.1045 1.0936 1.1045
irintensity: 0.1224 0.5277 4.2606 6.3907 0.2965 3.5047 1.4280 7.8051 10.9186 7.3491 6.6549 8.6252 0.5582 0.1367 5.3934 6.8773 1.1314 18.8136 4.6527 16.2711 0.4954 7.1153 3.9813 59.5214 34.4596 18.5523 46.8229 15.7342 41.4976 0.6102 53.4553 55.5291 40.9494 9.3139 3.3086 210.6899 46.1839 40.1656 27.3569 1.2796 5.8807 12.8952 0.9073 57.6725 1.6321 124.5028 13.2232 1.8903 20.7816 11.6463 29.0337 9.0524 10.1737 8.7142 420.1727 52.9955 46.7595 209.4531 16.1760 74.4964 50.4112 45.5829 53.3800 46.3283 33.3106 5.6911 31.8275 5.3675 19.7287
temp: 298.150 k
press: 1.00000 atm
elementType: 8 8 7 7 6 6 6 6 6 6 6 1 1 1 1 1 1 1 1 1 1 1 1 1 1
symmnumber: 1
zpe: 558184.6 jmol-1
zpe.correction: 0.212601 hartree
zpe.thermalcorrener: 0.224311 hartree
zpe.thermalcorrenthalpy: 0.225256 hartree
zpe.thermalcorrgfe: 0.174784 hartree
zpe.sumelectzpe: -534.192861 hartree
zpe.sumelectthermal: -534.181151 hartree
zpe.sumelectthermalent: -534.180206 hartree
zpe.sumelectthermalfe: -534.230677 hartree
dipole: 1.6599 -2.0179 -0.3753
dipole: 2.6397
quadrupole: -60.5525 -67.7836 -67.1704
quadrupole: 6.8914 -1.6626 1.2066
quadrupole: 4.6164 -2.6148 -2.0016 6.8914 -1.6626 1.2066
hfenergy: -534.405462 hartree
pointgroup: C01 [X(C7H14N2O2)]
dipole: -0.659452 0.7830783 -0.1744713 debye
dipolederiv: -1.263644 -0.3344541 0.1669867 -0.7471329 -0.8452127 0.1168448 0.20006 0.0462681 -0.3460567 -0.9131199 0.2249261 0.1086216 0.343595 -0.9646561 -0.0968932 0.1764172 -0.103909 -0.3876121 -0.6660524 0.0151066 -0.0677592 0.0161299 -0.5007402 0.0107356 -0.0226723 0.0058307 -0.584282 -1.4814071 0.0904727 0.1837211 0.0674094 -0.5139672 -0.0212172 0.1341464 -0.0187157 -0.3836177 0.2291441 0.2005472 -0.1158858 0.2378634 0.3208993 -0.0461919 -0.0737928 -0.0485601 0.3475043 0.148673 -0.1489303 -0.1200244 -0.194479 0.3948464 0.0714263 -0.0809685 0.0665351 0.3560107 0.1962868 -0.202632 -0.0410918 -0.3654897 0.3390642 0.0834789 -0.0249234 0.0888887 0.3275639 0.3074816 0.2160612 -0.037406 0.4149616 0.2391887 -0.0846495 -0.0021479 -0.0905947 0.2945588 0.4530749 -0.040553 0.096768 -0.0455812 0.0965272 -0.0247706 0.1184612 -0.0262263 0.4126547 2.3078447 -0.0697686 -0.4090705 0.2245555 1.3908355 0.0218327 -0.5182384 0.1058801 0.3556809 0.7823134 0.1404236 -0.0958873 0.0557104 0.244026 -0.0176977 -0.1281976 -0.0442175 0.3103591 -0.028654 0.1265579 0.0340982 0.0751268 -0.1277542 -0.0383418 0.0359139 -0.0520818 0.0631904 -0.0291813 -0.0788865 0.0351205 -0.0588855 0.0059522 -0.0321848 0.0827454 0.1213908 -0.2456176 0.0019008 0.0763348 0.0507354 0.0531508 -0.0125462 0.0477592 0.0612627 -0.1106695 -0.2480765 -0.0735315 -0.1427532 0.0266002 -0.0891808 -0.0846342 0.0155467 0.0370877 0.0282256 0.0705245 0.0563087 -0.0818882 -0.0029398 -0.0576948 -0.0094617 0.0140909 0.0094395 0.0348063 0.0956852 0.0099736 0.0744565 0.0663473 0.0887693 0.0324535 0.0262283 0.0579667 -0.0668231 -0.1716026 -0.0202789 -0.0668458 0.0536412 -0.0862246 0.0653389 -0.018422 0.0584389 0.0694943 -0.1637616 0.080185 0.0928839 0.0026851 0.0160163 -0.0136047 -0.0183052 0.002125 -0.0498508 0.0906156 0.025266 0.0736096 0.005877 0.1749783 -0.0962625 -0.0561648 0.0169113 -0.0758764 0.05122 -0.0296032 -0.0895239 0.0083622 -0.1915022 -0.0521889 0.0416562 0.0130387 0.059456 0.0633915 -0.0329597 0.0075125 0.0591203 0.0193949 0.0674835 0.0121412 -0.1659416 0.0340388 -0.2951811 0.030382 -0.054823 0.0172647 -0.1252122 -0.106075 0.0174511 0.0158912 0.0024251 0.1141418 -0.0162819 -0.0324298 0.0063179 0.0573477 0.0750844 -0.1045594 0.0677301 -0.0526842 -0.0986323 -0.0741206 0.0045958 -0.0322026 0.1163735 0.0554039 0.0802063 -0.0707533 0.0769696 -0.0286612 unknown
polarizability: 123.3498124|0.1273706|92.4011205|-3.5049245|0.6028111|72.1915535 unknown
InChI: InChI=1S/C7H14N2O2/c1-8-3-5-9(6-4-8)7(10)11-2/h3-6H2,1-2H3
charge 0 multiplicity 1
25 atoms
O  2.364528 0.872557 -0.060759
O  2.223492 -1.470367 -0.207295
N  -2.469272 0.137808 0.11313
N  0.361926 -0.171476 0.401478
C  -1.561161 1.284264 -0.135743
C  -1.813989 -1.14432 -0.247884
C  -0.264372 1.134933 0.684866
C  -0.525916 -1.337975 0.573947
C  -3.77796 0.305569 -0.548161
C  1.674747 -0.35835 0.030563
C  3.782043 0.741087 -0.452579
H  -2.075716 2.215392 0.166836
H  -1.298359 1.373046 -1.221948
H  -1.561076 -1.18585 -1.338798
H  -2.512685 -1.972851 -0.028323
H  0.447984 1.935978 0.442024
H  -0.515644 1.189438 1.763422
H  -0.791053 -1.439118 1.645401
H  0.020574 -2.238886 0.252432
H  -4.255627 1.237243 -0.195412
H  -4.438996 -0.538745 -0.282414
H  -3.708326 0.352946 -1.664539
H  4.156441 1.774501 -0.49296
H  3.869588 0.249221 -1.436129
H  4.337233 0.148357 0.294144
