program: Gaussian 09
title: 000228935
version: EM64L-G09RevD.01
frameworkgroup: C1[X(C11H21NO4)]
method: RPBEPBE
basis: SDD
operation: Freq
keyword: #p
keyword: freq=noraman
keyword: PBEPBE/SDD
title: #p freq=noraman PBEPBE/SDD
converged: YES YES NO NO
title: Mulliken charges:
elementType: O O O O N C C C C C C C C C C C H H H H H H H H H H H H H H H H H H H H H
charge: -0.310257 -0.279191 -0.288484 -0.288796 -0.616447 0.341241 -0.418752 -0.432457 -0.019337 -0.363098 -0.365356 -0.369118 -0.348491 -0.699032 -0.698381 0.310887 0.202781 0.220753 0.215837 0.211569 0.225105 0.228892 0.233310 0.201442 0.229293 0.199781 0.233620 0.237541 0.245004 0.217027 0.212027 0.210149 0.217241 0.213422 0.208549 0.342383 0.339346
chargesum: 0.00000
title: Mulliken charges with hydrogens summed into heavy atoms:
elementType: O O O O N C C C C C C C C C C C
charge: -0.310257 -0.279191 -0.288484 -0.288796 0.065281 0.341241 0.004782 -0.005052 0.205767 0.099103 0.065379 0.064283 0.134055 -0.059830 -0.059168 0.310887
polarizability: 1.72852559e+02 -6.56949826e+00 1.26538818e+02 2.55634727e+00 2.25929991e+00 1.16321787e+02
1716.lowfreq: -15.5819 -7.7127 0.0008 0.0008 0.0011 0.9814 9.1913 29.8650 47.9564
frequency: -6.4540 29.4733 47.9296 58.7183 72.0045 81.3528 89.2836 95.8224 128.9758 150.5209 197.9126 203.0736 230.6851 240.5744 252.0281 283.5061 297.4475 321.3563 344.3716 370.7535 426.8401 439.8665 492.7639 503.0236 517.1385 523.6277 606.0332 637.7195 668.9206 703.3897 732.0253 735.4308 757.8517 787.3624 805.7196 855.8595 865.4380 886.5389 894.6683 900.0057 913.5985 961.3460 998.7151 1009.2487 1028.8238 1037.8214 1053.5194 1058.2892 1078.3489 1105.2158 1108.7721 1122.4884 1130.5074 1166.7921 1185.4186 1203.0607 1235.2583 1239.6120 1259.6514 1271.2989 1280.3870 1287.9844 1296.8061 1305.3781 1309.5088 1314.8363 1353.4556 1355.5515 1360.7365 1377.9832 1388.3269 1389.8475 1451.6768 1454.7993 1457.5592 1469.9204 1473.0468 1476.3653 1477.5481 1478.3764 1484.9930 1487.8763 1587.7272 1686.5888 2971.3266 2971.9232 2979.6807 2980.9068 2987.9590 2988.8232 2998.2353 3010.8411 3027.2182 3031.2191 3039.1078 3048.9946 3056.4265 3071.5593 3071.9182 3072.4559 3075.3056 3113.2636 3122.9200 3557.8964 3715.5350
redmass: 4.8733 5.4779 3.4104 4.6602 2.5572 2.6524 2.4247 2.0261 2.9596 3.2139 4.0674 3.1049 1.1996 1.1831 4.2658 2.9539 2.6752 2.8965 2.8785 4.0342 2.3178 3.6574 3.3124 1.1862 3.1756 1.0786 4.8061 4.0465 4.4045 11.2374 1.2681 1.7809 1.8556 2.8736 2.3027 2.6779 1.5187 1.8508 1.8258 1.8669 1.6980 3.8088 3.7715 3.4879 2.6245 2.4763 2.5531 1.9807 2.0091 2.0713 2.0777 2.5662 2.4632 2.0512 1.2891 1.9848 1.2281 1.2811 1.5202 1.1822 1.2734 1.1700 1.2758 2.0137 1.4186 1.3805 1.5533 1.5889 1.5104 1.5337 1.2131 1.2140 1.0888 1.0959 1.0833 1.0917 1.0586 1.0443 1.0453 1.0429 1.0746 1.0862 1.2133 7.1331 1.0357 1.0355 1.0613 1.0620 1.0754 1.0690 1.0599 1.0651 1.0973 1.0976 1.0593 1.1015 1.1017 1.0994 1.0994 1.1011 1.1020 1.1022 1.1069 1.0446 1.1059
irintensity: 0.4708 5.0404 0.1344 0.8171 3.5424 3.5762 0.2653 0.0657 3.0360 0.3417 3.5640 4.3072 0.2231 0.7076 3.7714 16.5628 0.3204 3.0775 2.5853 3.0083 4.6465 12.3715 9.3600 256.8109 16.0835 71.1584 2.9535 7.0555 5.7402 36.3408 3.0766 0.6542 16.3963 10.9139 41.2248 2.6201 5.9517 22.0690 0.4664 14.5898 2.5946 60.8621 65.4932 252.5286 20.1755 14.4635 0.5925 19.7373 0.9677 2.0826 4.6256 15.0394 8.3804 69.3549 5.7075 13.0540 13.7948 2.6311 13.6578 6.5813 6.0701 0.7283 35.0442 235.0867 7.8186 80.2723 4.6755 2.5593 81.9303 8.7149 11.3878 8.0815 13.2637 22.1808 10.2448 9.1448 4.4758 14.7335 5.3982 8.9019 21.2208 5.3888 93.7112 377.6920 54.1896 32.1873 6.8054 7.7528 43.5178 23.6915 34.2383 37.5679 3.7062 0.5525 22.6221 11.3646 2.6600 61.8339 68.2224 37.7824 115.4788 21.4809 10.0580 76.8259 52.8984
temp: 298.150 k
press: 1.00000 atm
elementType: 8 8 8 8 7 6 6 6 6 6 6 6 6 6 6 6 1 1 1 1 1 1 1 1 1 1 1 1 1 1 1 1 1 1 1 1 1
symmnumber: 1
zpe: 827245.2 jmol-1
zpe.correction: 0.315081 hartree
zpe.thermalcorrener: 0.332813 hartree
zpe.thermalcorrenthalpy: 0.333757 hartree
zpe.thermalcorrgfe: 0.268563 hartree
zpe.sumelectzpe: -786.120333 hartree
zpe.sumelectthermal: -786.102601 hartree
zpe.sumelectthermalent: -786.101657 hartree
zpe.sumelectthermalfe: -786.166851 hartree
dipole: 2.3220 -0.9524 -1.2025
dipole: 2.7829
quadrupole: -72.6435 -97.2818 -102.9388
quadrupole: -10.1355 -3.0554 -0.1992
quadrupole: 18.3112 -6.3271 -11.9841 -10.1355 -3.0554 -0.1992
hfenergy: -786.4354139 hartree
pointgroup: C01 [X(C11H21N1O4)]
dipole: 0.9221034 0.3341215 0.4867064 debye
polarizability: 171.6345669|9.7101587|126.3299232|-4.2983812|3.3527797|117.7486733 unknown
InChI: InChI=1S/C11H21NO4/c1-3-5-11(6-4-2)15-8-9(16-11)7-14-10(12)13/h9H,3-8,12H2,1-2H3
charge 0 multiplicity 1
37 atoms
O  -0.302715 -0.285095 1.091843
O  -0.805689 1.102472 -0.765427
O  3.394974 0.184499 0.923999
O  3.577134 -0.157082 -1.408448
N  5.233162 0.952482 -0.166823
C  -1.405054 0.092853 0.138538
C  -1.805107 -1.165496 -0.656318
C  -2.522748 0.779889 0.935401
C  0.930188 0.438718 0.688772
C  0.647718 0.837725 -0.776269
C  -2.363554 -2.31391 0.214414
C  -3.709383 1.267363 0.072775
C  2.095029 -0.532154 0.926155
C  -2.600401 -3.600695 -0.604648
C  -4.731046 2.072934 0.903748
C  4.037431 0.290571 -0.328224
H  -0.90929 -1.522446 -1.20123
H  -2.548351 -0.871448 -1.422094
H  -2.879387 0.081054 1.715648
H  -2.066334 1.641274 1.458631
H  1.053182 1.33559 1.328719
H  0.912052 0.021683 -1.474382
H  1.141721 1.767918 -1.093079
H  -3.316079 -1.998608 0.684397
H  -1.652128 -2.515055 1.037734
H  -4.21963 0.400854 -0.392617
H  -3.319388 1.891052 -0.753551
H  2.104882 -1.332588 0.166027
H  2.021373 -0.961174 1.937082
H  -3.018194 -4.407338 0.025372
H  -1.654743 -3.970573 -1.043842
H  -3.307526 -3.420754 -1.436723
H  -5.585112 2.40089 0.283192
H  -4.263131 2.975964 1.338849
H  -5.131993 1.467663 1.739021
H  5.820449 1.103997 -0.981809
H  5.52849 1.266871 0.754266
