program: Gaussian 09
title: 000228954
version: EM64L-G09RevD.01
frameworkgroup: C1[X(C17H19Cl6NO2)]
method: RPBEPBE
basis: SDD
operation: Freq
keyword: #p
keyword: freq=noraman
keyword: PBEPBE/SDD
title: #p freq=noraman PBEPBE/SDD
converged: YES YES NO NO
title: Mulliken charges:
elementType: Cl Cl Cl Cl Cl Cl O O N C C C C C C C C C C C C C C C C C H H H H H H H H H H H H H H H H H H H
charge: 0.101324 0.101217 0.113680 0.140910 0.084943 0.085137 -0.168841 -0.168847 -0.152653 -0.247929 -0.247943 -0.170347 -0.170330 -0.491947 -0.008236 -0.008027 0.128512 0.128662 -0.381804 -0.360146 -0.378517 -0.386239 -0.375818 -0.352368 -0.357727 -0.695255 0.358561 0.358397 0.246033 0.245718 0.221985 0.221645 0.199773 0.199560 0.198682 0.198504 0.192172 0.192327 0.189129 0.189070 0.195462 0.195449 0.216034 0.210047 0.210040
chargesum: 0.00000
title: Mulliken charges with hydrogens summed into heavy atoms:
elementType: Cl Cl Cl Cl Cl Cl O O N C C C C C C C C C C C C C C C C C
charge: 0.101324 0.101217 0.113680 0.140910 0.084943 0.085137 -0.168841 -0.168847 -0.152653 0.110633 0.110454 -0.170347 -0.170330 -0.491947 -0.008236 -0.008027 0.128512 0.128662 0.109948 0.083484 0.020815 0.010947 0.008681 0.025831 0.033184 -0.059133
polarizability: 2.84447336e+02 -4.79937130e-01 2.42670865e+02 8.38747801e+00 1.12447623e+00 2.04603744e+02
1716.lowfreq: 0.0017 0.0023 0.0030 1.9534 3.0826 5.0927 13.7638 17.7577 34.9956
frequency: 12.3021 17.5804 34.7755 42.5348 55.9872 58.0801 78.3452 87.0753 90.0145 96.7933 98.3202 115.2432 117.1337 127.6741 135.9728 139.9364 145.4683 148.0442 153.5101 159.0551 165.4045 177.7434 216.1281 227.7920 232.9390 264.4885 269.9473 279.6502 304.8791 312.3464 340.6871 349.0467 354.9326 359.1138 419.2551 445.0692 458.1902 476.0644 518.7948 558.1271 589.0491 602.9235 616.2547 621.2467 673.1314 691.8918 717.2926 721.8503 730.9457 750.8400 772.6570 785.8016 789.0564 834.9818 848.3674 851.5833 877.9400 889.7007 930.1218 960.2677 962.8239 990.2174 998.1624 1005.3219 1014.0260 1025.3396 1043.5381 1047.6380 1055.3943 1060.6562 1075.7399 1078.0135 1081.5975 1086.0156 1122.4821 1131.4574 1147.2027 1185.1859 1202.8410 1215.2458 1224.0538 1233.0949 1248.6543 1257.5030 1265.6771 1267.1656 1278.0971 1284.7380 1294.9873 1298.2113 1305.3451 1324.0949 1339.3868 1340.6409 1355.9866 1359.1836 1373.0018 1391.0536 1448.2981 1461.2530 1461.6857 1466.2844 1470.9305 1477.8020 1478.4087 1484.5063 1488.2729 1597.9925 1633.0962 1695.8778 2952.1163 2953.7745 2957.3312 2963.8844 2969.5702 2972.6601 2986.8405 2987.5936 2995.5536 3007.3382 3019.8363 3023.2921 3038.2533 3051.0190 3069.5558 3071.7994 3078.8828 3088.4259 3090.4855
redmass: 8.1710 6.6191 1.8828 2.9802 5.2802 7.2589 10.2044 3.0665 3.0810 8.4866 3.0350 8.9251 12.4740 11.7683 2.0447 10.0126 2.2960 13.4431 33.9921 5.2691 19.9780 16.7148 11.3158 5.5856 1.1226 10.7405 5.1944 3.9843 4.6162 12.8039 26.6004 19.0720 7.7272 11.0424 4.4827 3.6722 7.2161 4.1861 6.5716 7.4678 9.6897 8.0257 11.8731 12.0482 6.7297 6.7524 3.6321 1.0816 1.0930 1.2279 7.7199 1.6002 3.3559 7.1173 1.5172 8.4161 3.7191 1.8955 1.4753 3.8441 3.5149 4.5124 1.7746 4.9133 4.0882 1.6832 7.3345 3.1962 3.9899 3.2539 3.7476 2.4633 2.2688 4.4366 2.8093 3.1939 4.0259 1.9107 1.8287 1.7477 1.2755 1.4276 1.4856 1.5594 1.6842 1.2905 1.2621 1.0269 1.0846 1.1278 1.3683 3.6415 1.4244 1.4622 1.6173 1.6086 1.4971 1.2178 1.0933 1.0732 1.0729 1.0699 1.0791 1.0751 1.0473 1.0882 1.0922 12.0233 12.4495 11.5012 1.0590 1.0590 1.0592 1.0591 1.0588 1.0364 1.0590 1.0971 1.0994 1.1023 1.0580 1.1042 1.1046 1.1045 1.1007 1.0993 1.0854 1.0860 1.1065
irintensity: 0.0014 0.0382 0.0054 0.0074 0.1461 0.2470 0.1895 0.0011 0.0278 0.1222 0.0590 0.0448 6.1342 0.0009 0.0020 0.4332 0.0070 0.2216 0.0025 0.3526 0.0059 2.7866 0.0270 0.4167 0.0059 0.1144 0.5321 2.6498 2.3352 0.6671 0.0004 1.4833 10.0165 5.1069 7.1237 6.2282 0.3067 5.1115 35.0606 0.7877 1.3156 4.4487 36.8613 12.8715 41.4091 10.8457 7.4402 9.6987 1.2576 17.1815 70.2932 7.4837 1.9711 45.2490 9.4360 3.8574 0.1794 6.0001 2.6200 0.8997 13.3883 0.9428 0.1490 2.3245 0.3030 8.0755 45.4406 3.5995 33.0526 17.8849 26.3854 0.1716 0.9063 10.6994 12.5413 88.5879 1.0552 12.0239 1.6552 22.0616 8.5496 29.5273 12.1393 43.1621 8.9018 0.0518 4.5948 0.8253 0.4533 0.1122 8.1346 159.2621 33.0457 20.9497 2.0546 0.9810 18.2828 11.2441 17.2418 0.0951 0.3290 0.8308 1.7115 4.3214 11.1050 3.4014 31.5213 50.9703 440.9637 33.2200 0.0786 1.6753 0.1154 16.6661 146.2897 37.2629 28.3782 0.0862 0.3241 1.0786 27.6960 0.0245 61.4971 71.6765 93.6300 55.9445 0.0241 1.7576 9.0467
temp: 298.150 k
press: 1.00000 atm
elementType: 17 17 17 17 17 17 8 8 7 6 6 6 6 6 6 6 6 6 6 6 6 6 6 6 6 6 1 1 1 1 1 1 1 1 1 1 1 1 1 1 1 1 1 1 1
symmnumber: 1
zpe: 863181.9 jmol-1
zpe.correction: 0.328769 hartree
zpe.thermalcorrener: 0.357150 hartree
zpe.thermalcorrenthalpy: 0.358094 hartree
zpe.thermalcorrgfe: 0.265938 hartree
zpe.sumelectzpe: -3622.784698 hartree
zpe.sumelectthermal: -3622.756317 hartree
zpe.sumelectthermalent: -3622.755372 hartree
zpe.sumelectthermalfe: -3622.847528 hartree
dipole: -1.4837 -0.0391 1.1605
dipole: 1.8841
quadrupole: -191.1213 -211.4147 -191.7158
quadrupole: 0.0021 4.0783 -0.5809
quadrupole: 6.9626 -13.3308 6.3681 0.0021 4.0783 -0.5809
hfenergy: -3623.1134664 hartree
pointgroup: C01 [X(C17H19Cl6N1O2)]
dipole: 0.5743951 -0.4684306 -0.0099294 debye
polarizability: 284.7537985|6.7821481|204.2878761|-0.0723314|-0.9580308|242.6802704 unknown
InChI: InChI=1S/C17H19Cl6NO2/c1-2-3-4-5-6-7-8-24-13(25)9-10(14(24)26)16(21)12(19)11(18)15(9,20)17(16,22)23/h9-10H,2-8H2,1H3
charge 0 multiplicity 1
45 atoms
Cl -3.481384 0.709777 -2.849821
Cl -3.523492 0.565588 2.862753
Cl -5.418431 -0.458478 -0.034564
Cl -4.61848 2.422935 0.043085
Cl -0.608484 2.134037 -1.706473
Cl -0.635037 2.04608 1.834723
O  -0.657105 -1.619798 -2.377848
O  -0.684046 -1.729713 2.312397
N  -0.378431 -1.726286 -0.03227
C  -2.533583 -1.074607 -0.812665
C  -2.543508 -1.113401 0.752795
C  -2.910224 0.423705 -1.138244
C  -2.926904 0.366507 1.147436
C  -3.961413 0.7005 0.0047
C  -1.766186 1.321912 -0.644565
C  -1.776299 1.288179 0.71657
C  -1.110632 -1.486966 -1.219826
C  -1.124584 -1.543448 1.15677
C  1.049743 -2.103938 -0.033712
C  1.972978 -0.864461 -0.008573
C  3.46635 -1.258632 -0.017847
C  4.39807 -0.025714 0.00552
C  5.899818 -0.389669 -0.006979
C  6.821309 0.850874 0.015627
C  8.32673 0.499682 0.000567
C  9.234391 1.748836 0.023842
H  -3.276666 -1.743423 -1.273337
H  -3.291157 -1.805149 1.170124
H  1.224002 -2.732711 0.857459
H  1.230813 -2.700045 -0.9458
H  1.751089 -0.229115 -0.887813
H  1.7521 -0.265343 0.895995
H  3.687654 -1.902057 0.858857
H  3.685381 -1.866294 -0.920293
H  4.176307 0.582027 0.907285
H  4.170795 0.619431 -0.868466
H  6.124179 -0.99655 -0.909054
H  6.130363 -1.033644 0.867372
H  6.597391 1.4575 0.918102
H  6.588665 1.496102 -0.857372
H  8.559643 -0.144817 0.872781
H  8.550906 -0.105386 -0.901667
H  10.30507 1.473522 0.011824
H  9.041073 2.394427 -0.853656
H  9.050827 2.35412 0.93166
