program: Gaussian 09
title: 000228943
version: EM64L-G09RevD.01
frameworkgroup: C1[X(C21H24N2O3)]
method: RPBEPBE
basis: SDD
operation: Freq
keyword: #p
keyword: freq=noraman
keyword: PBEPBE/SDD
title: #p freq=noraman PBEPBE/SDD
converged: YES YES NO NO
title: Mulliken charges:
elementType: O O O N N C C C C C C C C C C C C C C C C C C C C C H H H H H H H H H H H H H H H H H H H H H H H H
charge: -0.471406 -0.431584 -0.452733 -0.186595 -0.056459 -0.467504 -0.194151 0.410094 -0.348988 -0.359793 0.239784 -0.462050 -0.108173 0.031871 -0.328204 -0.320004 -0.392484 -0.327412 0.334160 -0.273922 -0.232614 -0.370773 -0.375615 -0.232602 -0.251998 -0.239781 0.237639 0.248487 0.208549 0.202483 0.230138 0.232054 0.228151 0.276946 0.192597 0.233274 0.208756 0.197056 0.223487 0.353351 0.263203 0.227741 0.232051 0.280354 0.227476 0.335791 0.351901 0.225435 0.224309 0.227705
chargesum: 0.00000
title: Mulliken charges with hydrogens summed into heavy atoms:
elementType: O O O N N C C C C C C C C C C C C C C C C C C C C C
charge: -0.118054 -0.095793 -0.100832 -0.186595 -0.056459 0.018623 0.014399 0.410094 0.083632 0.100412 0.239784 -0.185104 -0.108173 0.031871 0.097668 0.085808 -0.168997 -0.064209 0.334160 -0.046181 -0.000563 -0.090419 -0.148139 -0.007167 -0.027689 -0.012076
polarizability: 3.34837711e+02 5.42791894e+01 3.36454474e+02 -1.17563749e+01 3.29719165e+01 1.51137185e+02
1716.lowfreq: -3.0842 -0.0004 0.0002 0.0006 1.4012 4.5295 16.6556 18.1811 22.2678
frequency: 16.5456 18.1556 22.2407 40.5414 49.1446 56.3478 73.5201 76.6179 80.5268 93.2956 100.1984 140.2793 168.3855 180.8385 182.2239 211.2831 227.5117 236.2439 269.1816 274.7897 289.6868 305.1175 313.1276 324.6283 341.8876 365.2142 402.1985 404.0723 421.4175 458.6908 465.7588 484.2876 514.3188 517.0859 547.9196 559.4892 588.2266 611.0271 617.6151 638.2404 677.1515 686.8144 698.2757 712.8275 758.7368 770.1174 782.1189 798.2473 799.3990 816.3900 842.2242 854.6277 856.0694 858.7056 877.0739 906.6968 935.4414 938.4962 959.8431 963.0619 979.9517 986.2082 989.1144 994.3309 995.6954 998.4968 1007.5059 1019.4795 1023.3556 1025.3741 1035.8769 1048.1787 1065.5886 1072.1651 1079.3883 1085.3515 1114.8691 1138.3503 1141.4140 1170.1872 1171.7893 1185.1227 1189.8050 1210.9489 1215.7835 1236.8844 1240.6803 1250.4168 1273.0788 1280.2538 1283.1544 1292.7697 1302.3660 1310.6238 1312.7339 1326.2079 1345.2423 1348.5043 1353.8356 1361.1431 1380.9967 1385.3809 1388.7731 1393.9960 1416.8605 1417.1206 1439.6579 1449.4641 1459.0068 1467.1515 1474.1516 1481.8094 1487.4130 1488.4485 1511.1113 1540.8966 1586.1514 1594.3300 1610.4626 1621.4074 2892.3728 2926.5494 2945.0233 2951.3521 2960.7812 2963.7512 3001.0536 3045.1861 3060.5174 3065.4081 3092.6926 3123.5204 3124.4607 3133.8713 3137.9316 3147.8183 3154.1055 3159.9940 3169.7171 3170.4522 3187.9372 3228.2791 3561.3333 3582.4695
redmass: 5.5641 5.2417 4.0664 5.5226 5.2727 5.0148 2.8603 5.2117 2.9928 2.0931 5.4793 4.5006 4.7312 3.6047 3.4916 3.2626 3.8903 4.3389 1.0816 5.6412 5.7650 1.1524 5.5057 4.1382 3.1862 5.0342 2.8321 3.7226 3.1863 3.4037 3.4397 3.1348 3.7579 6.2628 3.3137 7.0639 4.5051 5.2417 5.7670 4.6572 5.4818 3.6248 1.6502 1.1125 4.2253 1.4377 2.2963 1.8252 1.3817 1.1829 3.9626 1.5720 2.6092 3.7096 1.7469 4.3868 1.4892 1.4780 1.3721 3.9926 4.9505 1.4719 4.8136 1.3476 3.6495 3.5901 1.3440 2.5258 2.4015 2.2204 2.3438 2.1678 2.3863 3.2117 2.2926 1.7123 1.6779 1.5386 1.5541 1.0829 1.1321 1.2114 1.1614 1.2441 1.6943 1.6431 1.5605 1.6293 1.3779 1.8248 1.2179 1.1441 2.0483 1.3865 1.3388 1.6368 1.2741 1.3378 1.3493 2.5666 4.5446 1.4920 2.2482 2.9143 2.3435 1.5486 2.5011 2.8562 1.0912 1.0753 1.0792 1.0847 2.5429 1.0947 3.7640 7.1341 6.4881 6.7638 6.0586 6.4758 1.0703 1.0823 1.0608 1.0623 1.0657 1.0691 1.1055 1.0888 1.0959 1.0971 1.0976 1.0847 1.0852 1.0885 1.0894 1.0934 1.0950 1.0969 1.0995 1.0981 1.0901 1.0632 1.0663 1.0667
irintensity: 0.1169 0.2270 0.0756 0.6726 0.7943 2.5839 4.4654 0.5506 6.2649 6.6438 1.5538 1.5518 0.9102 5.3519 5.3617 3.1234 3.4574 12.4575 134.2539 1.5842 1.3138 157.5037 6.2460 31.0789 2.5965 8.2008 0.3377 22.4149 0.4412 3.2335 7.3613 5.3760 4.8856 1.3154 8.2300 7.2197 9.3325 9.3515 1.8751 3.4745 4.9899 17.9275 51.5377 104.3811 1.9365 64.6501 34.1575 41.2347 4.5746 1.4696 7.8800 5.6517 10.9474 2.7672 3.4839 8.6743 34.0459 2.5528 3.2621 114.1418 111.8173 1.6775 0.2824 0.8588 10.6132 16.8052 2.0190 73.2510 0.5121 18.8220 35.7567 1.5802 19.3192 23.6947 5.0421 22.1269 20.2004 7.5142 3.6031 1.6448 1.6810 12.7312 25.7559 44.3905 10.4657 14.3815 9.3514 17.1901 1.4041 3.4408 8.6551 4.3192 12.5385 13.8185 14.0683 5.8891 10.3776 2.2685 29.3133 36.4496 7.6858 7.1092 31.3807 55.5219 4.6024 3.0749 25.7143 5.7364 9.1371 1.0302 8.5000 9.9054 7.5669 3.2962 25.8838 45.7675 15.3934 97.7495 2.1843 5.0245 80.4102 37.2911 2.2577 101.2814 52.2997 48.3530 45.0844 13.4192 27.7204 36.5618 32.0619 1.7009 4.2043 9.8724 17.7575 37.2695 30.0485 23.5041 28.6732 19.5371 1.0538 209.8142 9.3925 7.6238
temp: 298.150 k
press: 1.00000 atm
elementType: 8 8 8 7 7 6 6 6 6 6 6 6 6 6 6 6 6 6 6 6 6 6 6 6 6 6 1 1 1 1 1 1 1 1 1 1 1 1 1 1 1 1 1 1 1 1 1 1 1 1
symmnumber: 1
zpe: 1070798.9 jmol-1
zpe.correction: 0.407846 hartree
zpe.thermalcorrener: 0.432558 hartree
zpe.thermalcorrenthalpy: 0.433502 hartree
zpe.thermalcorrgfe: 0.350020 hartree
zpe.sumelectzpe: -1147.872410 hartree
zpe.sumelectthermal: -1147.847698 hartree
zpe.sumelectthermalent: -1147.846754 hartree
zpe.sumelectthermalfe: -1147.930236 hartree
dipole: 2.8937 -0.8550 2.5395
dipole: 3.9438
quadrupole: -147.0313 -132.4388 -169.5565
quadrupole: 5.6547 6.2722 6.9793
quadrupole: 2.6443 17.2367 -19.8810 5.6547 6.2722 6.9793
hfenergy: -1148.2802559 hartree
pointgroup: C01 [X(C21H24N2O3)]
dipole: -1.1802808 -0.4661541 -0.8928176 debye
polarizability: 337.2689141|-57.7530854|325.0209729|-15.9256737|-46.3240502|160.1394824 unknown
InChI: InChI=1S/C21H24N2O3/c24-12-10-23(11-13-25)15-21(26)18-14-20(16-6-2-1-3-7-16)22-19-9-5-4-8-17(18)19/h1-9,14,21,24-26H,10-13,15H2
charge 0 multiplicity 1
50 atoms
O  -1.415942 -0.910596 1.580754
O  -6.576723 0.423517 1.952829
O  -3.669268 -4.156037 -1.628262
N  -3.559998 -0.775257 -0.035427
N  2.601388 1.322799 -0.545966
C  -2.347037 -0.046527 -0.495313
C  -1.454544 0.288233 0.749734
C  -0.049138 0.690215 0.336186
C  -4.67076 0.118264 0.38616
C  -3.978211 -1.887864 -0.932612
C  0.226283 1.999006 -0.20716
C  0.995909 -0.226762 0.440013
C  1.585599 2.257245 -0.644257
C  2.321211 0.110506 -0.005593
C  -5.49657 -0.484212 1.542758
C  -3.162446 -3.161987 -0.671104
C  -0.745629 3.045019 -0.334124
C  1.912441 3.536054 -1.202148
C  3.450705 -0.862057 0.092441
C  -0.396826 4.285733 -0.875985
C  0.94095 4.532176 -1.318471
C  4.682924 -0.567694 -0.554913
C  3.341137 -2.080481 0.817795
C  5.766338 -1.465558 -0.487808
C  4.428072 -2.978303 0.887289
C  5.644802 -2.678283 0.232683
H  -2.591108 0.87257 -1.068354
H  -1.76778 -0.713719 -1.157405
H  -1.928454 1.117672 1.320505
H  -5.344016 0.36108 -0.471616
H  -4.246035 1.074931 0.740074
H  -3.88593 -1.614137 -2.006205
H  -5.041894 -2.119869 -0.748001
H  0.770253 -1.203931 0.870024
H  -5.895515 -1.483725 1.268361
H  -4.864546 -0.595562 2.438206
H  -2.079285 -2.971541 -0.824357
H  -3.315453 -3.492088 0.37816
H  -1.772377 2.882569 0.012144
H  -2.333477 -1.306781 1.432758
H  2.946768 3.694403 -1.522435
H  -1.148857 5.078247 -0.958252
H  1.200397 5.508491 -1.742311
H  4.759149 0.377088 -1.10097
H  2.41641 -2.329992 1.348083
H  -7.242723 0.491045 1.22267
H  -3.153287 -4.995687 -1.542197
H  6.706543 -1.222746 -0.995856
H  4.32702 -3.90909 1.456755
H  6.48733 -3.376973 0.28652
