program: Gaussian 09
title: 000021619
version: EM64L-G09RevD.01
frameworkgroup: C1[X(C6H4ClNOS)]
method: RPBEPBE
basis: SDD
operation: Freq
keyword: #p
keyword: freq=noraman
keyword: PBEPBE/SDD
title: #p freq=noraman PBEPBE/SDD
converged: NO YES NO NO
title: Mulliken charges:
elementType: Cl S O N C C C C C C H H H H
charge: -0.014132 0.755689 -0.515147 -0.455493 0.287666 -0.204221 -0.265631 -0.194770 -0.206810 -0.215640 0.276593 0.261487 0.245472 0.244935
chargesum: 0.00000
title: Mulliken charges with hydrogens summed into heavy atoms:
elementType: Cl S O N C C C C C C
charge: -0.014132 0.755689 -0.515147 -0.455493 0.287666 -0.204221 0.010962 0.066717 0.038662 0.029295
polarizability: 2.14541521e+02 -2.56046339e-01 1.07703977e+02 -5.97994163e-03 3.04104271e-03 3.76137394e+01
1716.lowfreq: -8.8820 -5.7505 -0.0020 -0.0006 0.0022 6.0729 75.7987 86.0370 133.4533
frequency: 75.7961 86.0304 133.4521 170.3400 224.2896 279.7906 287.5332 357.2519 440.0054 445.4646 529.8332 557.0767 636.2806 675.8639 705.1368 768.6596 866.9159 868.0855 893.7265 954.5223 991.1611 1014.3448 1035.7309 1117.8990 1168.8873 1239.3379 1249.0952 1355.5331 1414.3695 1432.1531 1539.1301 1578.9166 3147.9827 3161.1158 3174.0802 3184.4862
redmass: 7.6089 12.5723 14.3624 6.0670 15.4084 13.7667 6.2148 8.5065 9.9054 3.3256 3.8020 8.9995 7.2324 9.2248 3.3172 1.3169 1.3737 15.8630 8.1556 1.3714 1.3452 7.2132 2.0152 1.6217 1.0698 3.1566 1.7687 5.1023 2.2494 2.6868 5.4666 6.2555 1.0863 1.0907 1.0954 1.1003
irintensity: 5.5022 9.5682 1.0719 1.5510 2.5115 0.1037 0.0807 9.6450 1.3187 8.6083 0.1076 9.8826 2.6049 13.8176 5.7723 93.6085 1.1718 84.3810 20.4415 3.0282 0.0322 29.2116 6.9358 0.2192 0.3567 8.8543 1.1823 3.2814 8.5151 45.5616 4.3448 21.3338 1.6713 5.9651 4.1668 11.5933
temp: 298.150 k
press: 1.00000 atm
elementType: 17 16 8 7 6 6 6 6 6 6 1 1 1 1
symmnumber: 1
zpe: 225856.6 jmol-1
zpe.correction: 0.086024 hartree
zpe.thermalcorrener: 0.095258 hartree
zpe.thermalcorrenthalpy: 0.096202 hartree
zpe.thermalcorrgfe: 0.050428 hartree
zpe.sumelectzpe: -1218.323881 hartree
zpe.sumelectthermal: -1218.314647 hartree
zpe.sumelectthermalent: -1218.313703 hartree
zpe.sumelectthermalfe: -1218.359477 hartree
dipole: 5.9237 1.5621 0.0008
dipole: 6.1262
quadrupole: -73.3321 -70.1016 -72.6962
quadrupole: -9.4088 0.0026 -0.0044
quadrupole: -1.2888 1.9417 -0.6529 -9.4088 0.0026 -0.0044
hfenergy: -1218.4099053 hartree
pointgroup: C01 [X(C6H4Cl1N1O1S1)]
dipole: -2.3776137 -0.3699192 -0.1392551 debye
dipolederiv: -0.1447162 0.2216264 0.0208453 0.023871 -0.6058491 -0.0660225 -0.0019725 -0.057948 -0.0334431 0.9825095 -0.0477401 0.0171028 0.4483595 0.3053163 0.0034404 0.0747755 -0.0166866 0.4352937 -1.004006 0.1774155 -0.0059076 -0.4171897 -0.2810745 -0.0082443 -0.0748831 0.0161161 -0.3587081 0.1228821 -0.110005 0.0040728 0.1153611 -0.0851679 0.0281554 0.0292491 0.0189182 -0.2862185 -0.0802117 0.1053615 0.0041118 -0.0411365 -0.1976569 -0.0375611 -0.0123323 -0.0317422 0.1101355 0.3020956 -0.5179236 -0.0451719 0.0378678 0.7304588 0.0928825 0.0188335 0.0701261 -0.0502611 0.0781429 0.1051617 0.0196146 -0.1231951 0.0473325 0.0128225 -0.0063854 0.0222224 -0.1048959 -0.3189441 0.2424415 0.0184401 0.2922532 -0.1549962 0.0036952 0.0243326 0.0017164 -0.0822331 -0.0934362 -0.2102427 -0.0220604 -0.2231648 0.019944 0.0109769 -0.0239087 0.0116683 -0.1517754 0.0798537 0.0351056 0.0128833 -0.1048273 0.1540255 0.0290155 -0.0027656 0.0346683 -0.1301854 0.0725858 -0.0480104 -0.0092172 -0.0339582 0.0208673 -0.0178755 -0.0075408 -0.0184788 0.160768 0.0643611 -0.0348311 -0.0081597 -0.0668451 -0.0056858 -0.0225904 -0.0119646 -0.0213299 0.1627573 0.0238982 0.0826675 0.0037921 0.1007723 -0.0347439 -0.0193403 0.0059688 -0.0202006 0.165096 -0.0850147 -0.0010265 -0.0103462 -0.0081683 0.0872299 -0.0093543 -0.0114064 -0.0090496 0.1636702 unknown
polarizability: 213.1799038|-11.3975994|107.9418712|5.836285|7.6645496|38.7374628 unknown
InChI: InChI=1S/C6H4ClNOS/c7-5-3-1-2-4-6(5)8-10-9/h1-4H
charge 0 multiplicity 1
14 atoms
Cl 0.275901 -2.435781 -0.310052
S  2.717725 -0.51596 0.011573
O  4.086683 0.365024 0.169813
N  1.448392 0.635146 0.09153
C  0.080696 0.370787 0.006089
C  -0.633729 -0.864958 -0.165531
C  -0.723428 1.56099 0.111342
C  -2.035612 -0.917157 -0.228249
C  -2.123819 1.518115 0.049718
C  -2.78652 0.27683 -0.120448
H  -0.176913 2.499423 0.242227
H  -2.537195 -1.880353 -0.360393
H  -2.700789 2.444156 0.13391
H  -3.878991 0.230738 -0.170529
