program: Gaussian 09
title: 000228920
version: EM64L-G09RevD.01
frameworkgroup: C1[X(C16H30O2)]
method: RPBEPBE
basis: SDD
operation: Freq
keyword: #pfreq=noraman
keyword: PBEPBE/SDD
title: #p freq=noraman PBEPBE/SDD
converged: YES YES NO NO
title: Mulliken charges:
elementType: O O C C C C C C C C C C C C C C C C H H H H H H H H H H H H H H H H H H H H H H H H H H H H H H
charge: -0.265144 -0.250565 0.014071 -0.397928 0.022030 -0.061555 -0.446884 -0.381065 -0.376942 -0.386697 -0.384298 -0.724046 -0.714480 -0.373159 -0.381943 -0.456731 -0.034949 -0.598574 0.175343 0.191521 0.226554 0.191374 0.227759 0.224448 0.212077 0.228479 0.180855 0.191007 0.197119 0.192797 0.195671 0.195639 0.192892 0.232712 0.203772 0.226962 0.241380 0.218199 0.214981 0.190208 0.195566 0.212242 0.194669 0.197637 0.205176 0.211621 0.213118 0.217078
chargesum: 0.00000
title: Mulliken charges with hydrogens summed into heavy atoms:
elementType: O O C C C C C C C C C C C C C C C C
charge: -0.265144 -0.250565 0.189414 0.020147 0.213404 0.166204 -0.010359 0.028268 0.011184 0.001771 0.004233 -0.060599 -0.039919 0.012615 0.024968 -0.053917 0.176672 -0.168378
polarizability: 2.37222785e+02 6.02508153e+00 1.64664897e+02 -1.02759918e+01 -2.32508145e+00 1.42341999e+02
1716.lowfreq: -24.1677 -10.9195 -2.0182 -0.0007 0.0008 0.0015 8.3743 25.4433 28.9191
frequency: 2.4580 24.5210 27.7950 38.2091 59.3909 68.0544 78.1743 104.1949 109.0854 123.1610 135.7863 142.9517 146.2680 149.8353 170.3836 177.0006 193.4660 207.8377 243.1276 280.5752 307.8610 336.5046 369.7491 385.9280 427.8366 434.9397 444.3420 459.7270 481.7895 528.2425 559.6325 637.7290 669.9686 719.7685 725.5669 738.4997 764.1280 777.8684 803.2837 841.8961 858.5179 877.2640 893.0887 916.7175 921.8459 928.8236 938.6914 949.4038 981.8126 988.6062 992.1279 1003.2060 1009.8828 1025.2827 1037.4137 1043.1790 1061.3465 1076.1171 1080.8505 1083.4257 1096.9339 1102.0011 1121.3516 1133.3189 1149.2392 1172.0369 1182.8020 1202.0087 1213.7905 1230.0541 1237.9245 1244.5879 1267.2407 1270.4873 1275.0140 1279.4066 1282.3735 1288.7464 1292.6012 1294.4947 1295.3775 1301.7992 1322.0570 1324.3251 1336.1329 1341.1738 1349.0356 1354.2261 1357.0750 1362.5683 1379.8484 1382.4340 1388.8467 1424.9638 1433.4639 1452.5631 1457.4939 1458.8237 1460.7762 1462.3482 1465.7613 1466.5754 1473.8315 1477.6098 1479.1456 1482.3769 1487.5407 1657.6261 2894.6837 2918.3198 2949.3270 2950.1950 2952.0401 2952.8437 2958.6952 2964.0160 2967.6472 2983.6416 2985.7195 2988.7494 2991.2777 2992.3898 2999.5143 3004.0169 3014.2972 3027.1099 3033.6211 3038.0437 3045.0677 3059.1109 3067.9805 3069.6827 3079.0886 3088.5291 3088.8061 3094.2211 3096.9533 3192.3284
redmass: 3.9486 2.9957 2.4813 3.2634 2.1936 2.9798 2.6573 1.9481 2.8401 2.5872 2.3161 3.0696 2.2790 2.5980 3.2259 1.2693 1.8730 1.1024 2.8322 2.6699 3.4791 2.6048 2.8560 3.6714 2.3595 3.4153 2.9910 2.2843 2.8251 3.0018 4.1757 1.5404 2.6999 1.0617 1.1037 1.2395 1.5677 3.1847 1.5332 1.8367 1.9603 2.4848 2.1951 1.6330 1.8537 2.2973 1.3684 2.4036 1.4988 1.7883 2.9354 1.2752 2.1227 1.3673 3.0925 1.6722 2.3928 2.4716 2.1475 2.3083 2.9061 2.5007 2.0000 2.0157 2.1309 2.0683 1.9654 1.3119 1.4918 1.4042 1.2986 1.3573 1.2385 1.2614 1.4376 1.0921 1.0853 1.1817 1.1052 1.1596 1.1324 1.2970 1.3152 1.3843 1.2734 1.3188 1.4130 1.6243 1.5400 1.5430 1.4937 1.2653 1.3900 1.1788 1.0955 1.0823 1.0914 1.0471 1.0704 1.0722 1.0798 1.0532 1.0970 1.0506 1.0493 1.0998 1.1004 4.7472 1.0824 1.0833 1.0588 1.0588 1.0612 1.0599 1.0608 1.0638 1.0608 1.0956 1.0386 1.0396 1.0972 1.0537 1.0616 1.0970 1.0988 1.1009 1.0879 1.1013 1.1034 1.1017 1.1028 1.0796 1.0979 1.0993 1.0739 1.0998 1.1001 1.1144
irintensity: 0.1028 0.1239 0.1259 0.6042 0.2056 0.0735 0.6910 0.0956 0.4324 0.3978 0.9367 0.5158 0.3398 0.8916 0.1058 0.7881 1.1740 0.1427 1.0001 0.3283 2.6449 1.5343 1.1720 9.1154 1.4417 1.0083 0.0329 4.0121 2.0675 2.0815 4.8210 16.1642 2.0047 14.1969 0.7937 1.3090 12.6739 6.8118 3.2255 2.4747 8.8839 61.9216 26.6804 7.3681 2.4029 29.2585 96.4901 33.5292 5.1411 4.0396 4.4822 17.8451 6.6808 1.0631 0.8929 1.9676 12.5637 7.4193 0.4693 21.0576 67.0084 9.7261 89.8878 8.5314 14.8075 13.7483 2.0365 25.9404 0.8080 23.4693 3.3223 0.7517 2.8507 0.2742 19.2607 1.0668 3.6474 2.7742 5.9260 1.8470 10.1071 0.3027 4.7850 11.6961 11.5281 2.3568 1.6538 1.0846 3.9087 2.7978 21.0185 32.5008 24.9753 3.4898 9.0446 4.4591 3.3549 7.6782 0.0755 0.7941 0.2696 13.3913 2.3716 9.7711 5.1900 1.2493 28.2418 22.5967 52.5773 61.2529 1.0681 0.5498 11.8994 7.5908 14.8226 39.2855 158.1738 3.6118 20.2906 13.2949 2.5000 43.1838 20.7145 9.9638 3.5269 9.0877 27.0172 6.1979 165.6824 22.5772 66.2312 53.1939 50.0284 36.8454 6.6736 29.8864 33.4770 33.9779
temp: 298.150 k
press: 1.00000 atm
elementType: 8 8 6 6 6 6 6 6 6 6 6 6 6 6 6 6 6 6 1 1 1 1 1 1 1 1 1 1 1 1 1 1 1 1 1 1 1 1 1 1 1 1 1 1 1 1 1 1
symmnumber: 1
zpe: 1124401.6 jmol-1
zpe.correction: 0.428262 hartree
zpe.thermalcorrener: 0.450466 hartree
zpe.thermalcorrenthalpy: 0.451410 hartree
zpe.thermalcorrgfe: 0.371973 hartree
zpe.sumelectzpe: -776.637733 hartree
zpe.sumelectthermal: -776.615529 hartree
zpe.sumelectthermalent: -776.614585 hartree
zpe.sumelectthermalfe: -776.694022 hartree
dipole: -2.4255 0.3757 1.7273
dipole: 3.0013
quadrupole: -103.0111 -112.9638 -115.1610
quadrupole: -5.7160 -5.8925 -2.3673
quadrupole: 7.3675 -2.5851 -4.7824 -5.7160 -5.8925 -2.3673
hfenergy: -777.065995 hartree
pointgroup: C01 [X(C16H30O2)]
dipole: -0.9443083 -0.4374824 0.5578281 debye
polarizability: 235.570621|16.2941546|157.5598083|-1.3165511|11.4230014|151.0992518 unknown
InChI: InChI=1S/C16H30O2/c1-4-5-6-7-8-9-10-11-12-16-17-14(2)13-15(3)18-16/h4,14-16H,1,5-13H2,2-3H3
charge 0 multiplicity 1
48 atoms
O  -3.448682 0.545983 0.382725
O  -4.221663 -0.723323 -1.529968
C  -3.225703 -0.631329 -0.461379
C  -5.8715 0.394953 -0.045004
C  -4.778675 0.479686 1.043732
C  -5.622963 -0.782064 -1.023443
C  -1.858503 -0.49544 -1.121546
C  -0.693191 -0.483597 -0.108785
C  0.680094 -0.29731 -0.791114
C  1.856245 -0.25472 0.209956
C  3.230406 -0.05944 -0.469549
C  -4.889466 1.725632 1.921958
C  -5.965291 -2.171359 -0.446444
C  4.403095 0.021463 0.533536
C  5.777576 0.200674 -0.149012
C  6.945895 0.314321 0.867472
C  8.300337 0.406919 0.197323
C  9.187093 1.423598 0.345611
H  -3.292396 -1.539952 0.185371
H  -6.869002 0.288308 0.424368
H  -5.858489 1.342078 -0.615892
H  -4.802624 -0.435651 1.679426
H  -6.218341 -0.626299 -1.940596
H  -1.864763 0.441124 -1.710286
H  -1.744647 -1.332028 -1.837022
H  -0.862838 0.329966 0.621974
H  -0.689093 -1.432567 0.468374
H  0.846658 -1.118348 -1.520097
H  0.668905 0.643178 -1.380746
H  1.870062 -1.193689 0.8024
H  1.68656 0.567595 0.936259
H  3.20775 0.866956 -1.080752
H  3.410675 -0.894274 -1.179032
H  -4.0711 1.748518 2.661958
H  -5.854423 1.738577 2.460778
H  -4.818868 2.636402 1.30146
H  -5.663961 -2.956761 -1.160973
H  -7.056197 -2.252742 -0.283312
H  -5.466361 -2.371323 0.518412
H  4.420018 -0.898338 1.155528
H  4.228025 0.865494 1.233212
H  5.763851 1.106999 -0.786898
H  5.965655 -0.656818 -0.828244
H  6.920872 -0.580111 1.526586
H  6.787796 1.195474 1.519617
H  8.559328 -0.43177 -0.469831
H  10.150808 1.429213 -0.176486
H  8.97224 2.28154 0.995474
