program: Gaussian 09
title: 000228910
version: EM64L-G09RevD.01
frameworkgroup: C1[X(C18H18O)]
method: RPBEPBE
basis: SDD
operation: Freq
keyword: #pfreq=noraman
keyword: PBEPBE/SDD
title: #p freq=noraman PBEPBE/SDD
converged: YES YES NO NO
title: Mulliken charges:
elementType: O C C C C C C C C C C C C C C C C C C H H H H H H H H H H H H H H H H H H
charge: -0.457419 -0.092735 -0.108229 -0.585761 -0.583787 0.405494 0.381970 0.394634 0.395012 -0.425231 -0.757422 -0.484536 -0.480354 -0.481142 -0.486865 -0.238293 -0.239579 -0.239549 -0.239398 0.262043 0.234848 0.282823 0.241241 0.202016 0.217321 0.211296 0.241416 0.216628 0.246770 0.247836 0.240574 0.243155 0.222631 0.222954 0.222598 0.222412 0.344628
chargesum: 0.00000
title: Mulliken charges with hydrogens summed into heavy atoms:
elementType: O C C C C C C C C C C C C C C C C C C
charge: -0.112791 0.169308 0.126619 -0.302938 -0.342545 0.405494 0.381970 0.394634 0.395012 -0.005895 -0.088082 -0.237766 -0.232518 -0.240568 -0.243710 -0.015662 -0.016625 -0.016951 -0.016986
polarizability: 2.19337773e+02 5.44424444e+00 1.58562899e+02 2.49742077e+00 -1.42914026e+01 1.75378629e+02
1716.lowfreq: -4.9614 -0.0004 -0.0002 0.0003 6.4168 14.8830 52.2638 65.2943 98.4723
frequency: 52.2152 65.2858 98.4631 113.7397 141.8370 152.2626 180.0414 224.5343 237.1660 256.6907 275.9077 286.6844 347.9978 354.7255 369.5425 383.9397 441.3545 459.0494 476.2655 492.4583 511.5693 553.6757 598.3484 612.7417 626.8137 643.5405 698.2328 754.3808 755.6564 763.0679 778.9136 783.9715 800.9325 820.2574 862.3536 864.2542 883.0636 893.2720 915.8647 938.8443 943.6099 955.8445 965.6997 983.1972 983.5032 1013.5760 1023.4415 1024.0055 1043.3093 1059.1779 1076.4200 1098.5582 1110.8517 1119.3208 1168.5804 1169.4234 1171.2009 1172.6477 1186.0857 1196.3781 1201.1728 1212.7046 1219.3598 1220.4091 1237.0810 1246.1345 1283.6838 1295.2227 1308.3971 1329.5584 1343.1613 1348.5037 1387.4781 1393.1179 1396.5803 1402.6541 1443.6596 1451.0234 1463.5569 1469.7263 1473.8071 1477.8049 1481.1203 1592.4785 1597.9987 1612.1190 1620.5138 2933.7786 2969.1576 2973.6295 2986.1201 3016.6316 3039.0310 3063.6710 3075.2173 3077.0794 3116.4816 3116.7382 3124.0677 3124.4490 3137.7288 3138.0588 3157.5692 3158.0339 3576.1488
redmass: 5.0796 4.8819 3.8142 4.0223 3.8201 3.7192 2.7134 1.8242 1.3838 1.5355 2.0820 3.4930 4.0389 3.3486 4.3187 4.4349 3.4317 3.9662 3.7508 4.2474 4.1246 3.6393 3.9915 3.5397 4.8987 6.2693 4.8670 1.3780 3.3782 1.5180 4.8702 3.4700 2.6794 2.4714 2.4384 1.6168 1.6497 3.5920 2.8017 1.6643 1.4061 1.6871 4.3561 1.3151 1.3154 1.8562 2.3077 2.2473 2.1373 2.2658 2.4816 1.8647 1.8320 1.7022 1.3839 1.0808 1.3958 2.5412 1.2675 1.2585 1.4073 1.5344 1.5412 1.6830 1.5585 2.1205 1.3939 1.3812 1.3567 1.4141 1.4000 1.4616 1.2473 5.9812 5.6208 1.4373 2.3900 2.4689 2.3036 1.0793 1.0519 1.1231 2.4495 6.1429 7.1228 6.9520 7.1451 1.0553 1.0648 1.0538 1.1027 1.0892 1.0875 1.0988 1.0996 1.0877 1.0856 1.0855 1.0891 1.0891 1.0941 1.0942 1.1003 1.1003 1.0666
irintensity: 0.1421 0.9795 0.8799 6.2221 0.4097 0.4381 5.7936 0.2232 12.8545 78.3130 48.5626 11.0439 1.8975 0.8147 0.0306 0.5471 1.9275 5.7716 5.6627 6.6460 8.9958 23.8997 1.9253 5.3514 9.7899 2.6204 2.7190 25.7580 14.4082 88.4280 1.6394 2.7059 0.4285 6.7184 0.2123 0.0759 0.2190 0.5101 0.0036 6.5496 0.4905 8.1741 45.3899 0.0151 0.0020 16.0902 2.2472 8.7090 34.6331 12.6190 0.6090 10.5069 5.3834 4.7990 2.6875 0.4237 4.4864 5.3811 7.7960 4.3957 2.0391 0.3485 6.3861 1.6860 11.7445 19.9781 11.9091 0.6028 1.1221 1.4215 0.5658 1.1161 13.2699 0.2958 0.6803 1.2640 11.7981 0.3686 41.4388 5.5526 5.0630 3.7797 12.9955 1.9992 0.0911 0.0598 0.1690 47.2844 33.3327 41.2316 25.5582 46.9740 26.7699 34.9056 36.0626 7.0825 0.1869 6.9739 3.7414 2.9058 1.3967 62.8957 63.2538 18.1296 2.4003
temp: 298.150 k
press: 1.00000 atm
elementType: 8 6 6 6 6 6 6 6 6 6 6 6 6 6 6 6 6 6 6 1 1 1 1 1 1 1 1 1 1 1 1 1 1 1 1 1 1
symmnumber: 1
zpe: 808839.3 jmol-1
zpe.correction: 0.308071 hartree
zpe.thermalcorrener: 0.323511 hartree
zpe.thermalcorrenthalpy: 0.324456 hartree
zpe.thermalcorrgfe: 0.266242 hartree
zpe.sumelectzpe: -770.595168 hartree
zpe.sumelectthermal: -770.579727 hartree
zpe.sumelectthermalent: -770.578783 hartree
zpe.sumelectthermalfe: -770.636997 hartree
dipole: -1.3558 0.9538 1.4140
dipole: 2.1788
quadrupole: -102.4688 -110.3149 -105.6201
quadrupole: -5.4345 1.4679 -1.6888
quadrupole: 3.6658 -4.1803 0.5145 -5.4345 1.4679 -1.6888
hfenergy: -770.9032384 hartree
pointgroup: C01 [X(C18H18O1)]
dipole: -0.5329303 0.4146458 0.5280649 debye
polarizability: 219.5538129|2.9105032|157.4946266|3.2600086|-13.8782059|176.2308608 unknown
InChI: InChI=1S/C18H18O/c1-11-16(10-19)18-14-8-4-2-6-12(14)17(11)13-7-3-5-9-15(13)18/h2-9,11,16-19H,10H2,1H3
charge 0 multiplicity 1
37 atoms
O  -1.375381 3.32629 -1.367397
C  -0.153214 1.850842 0.112044
C  -0.037196 1.240306 1.556288
C  -0.117056 0.693877 -0.964569
C  0.191142 -0.324476 1.430628
C  1.230947 0.003461 -0.774602
C  -1.205795 -0.308661 -0.594384
C  1.402123 -0.542389 0.527874
C  -1.034401 -0.869397 0.701864
C  -1.408875 2.71864 -0.023291
C  1.061837 1.925525 2.394368
C  2.260722 -0.102554 -1.728489
C  -2.302306 -0.688537 -1.391706
C  2.600444 -1.195229 0.873045
C  -1.957924 -1.8089 1.19796
C  3.466555 -0.76377 -1.383399
C  -3.230446 -1.638513 -0.895277
C  3.63566 -1.308308 -0.08898
C  -3.059132 -2.196363 0.393235
H  0.722604 2.499223 -0.082002
H  -1.008205 1.368119 2.078333
H  -0.249215 1.117415 -1.972786
H  0.322595 -0.77347 2.431121
H  -1.402933 3.50719 0.760435
H  -2.31903 2.094196 0.10328
H  1.082638 1.532239 3.428394
H  2.058408 1.762266 1.945544
H  0.891403 3.01696 2.452755
H  2.129256 0.321851 -2.730734
H  -2.432537 -0.2558 -2.390506
H  2.731344 -1.615683 1.877432
H  -1.824227 -2.241956 2.196563
H  4.270406 -0.855923 -2.122656
H  -4.082064 -1.945873 -1.513023
H  4.569606 -1.820149 0.16973
H  -3.778281 -2.933465 0.76841
H  -2.182374 3.883913 -1.496203
