program: Gaussian 09
title: 000228922
version: EM64L-G09RevD.01
frameworkgroup: C1[X(C20H38O2)]
method: RPBEPBE
basis: SDD
operation: Freq
keyword: #pfreq=noraman
keyword: PBEPBE/SDD
title: #p freq=noraman PBEPBE/SDD
converged: YES YES NO NO
title: Mulliken charges:
elementType: O O C C C C C C C C C C C C C C C C C C C C H H H H H H H H H H H H H H H H H H H H H H H H H H H H H H H H H H H H H H
charge: -0.238817 -0.239723 0.384839 -0.483455 -0.427255 -0.430428 -0.397567 0.013679 -0.383779 -0.448767 -0.737725 -0.383519 -0.347138 -0.375723 -0.388790 -0.699230 -0.383197 -0.373977 -0.380901 -0.456931 -0.034348 -0.598967 0.204289 0.191564 0.186031 0.235098 0.237144 0.187268 0.194111 0.247632 0.181528 0.203455 0.207229 0.225215 0.212053 0.216224 0.219719 0.222237 0.227884 0.181173 0.193717 0.194721 0.199627 0.189062 0.198105 0.191416 0.197141 0.191429 0.210552 0.211106 0.217557 0.189118 0.196897 0.193726 0.212804 0.197702 0.205294 0.211495 0.213276 0.217121
chargesum: 0.00000
title: Mulliken charges with hydrogens summed into heavy atoms:
elementType: O O C C C C C C C C C C C C C C C C C C C C
charge: -0.238817 -0.239723 0.384839 -0.087602 -0.006125 -0.006016 0.044177 0.195206 0.026905 -0.011500 -0.079544 0.025537 0.041299 0.012966 0.000730 -0.060015 0.005374 0.012038 0.025629 -0.053935 0.177147 -0.168571
polarizability: 3.03537355e+02 1.17038153e+01 1.91074687e+02 -4.68861676e+00 2.62126331e+00 1.81742027e+02
1716.lowfreq: -12.9497 -5.4764 -0.0022 0.0015 0.0017 6.5018 13.3482 18.7665 30.6514
frequency: 10.2422 17.7532 30.6428 32.0907 47.4228 50.1913 56.5252 65.2196 70.9951 79.9319 94.5772 110.6468 111.1081 119.0662 128.4565 140.8948 146.0825 148.8146 174.5941 179.1583 219.6232 235.2998 237.4314 252.0497 265.4632 277.8666 289.0439 314.0157 343.3257 353.5876 373.7117 417.3491 440.6677 445.1143 459.6323 482.1798 500.9855 545.3019 550.8727 636.8988 663.6313 719.0448 725.2789 726.4727 728.3742 738.3866 760.7717 766.5734 786.5011 809.0449 861.2084 884.3379 890.7043 894.4539 916.7469 924.7636 927.0497 937.1191 940.2143 950.8310 972.9720 986.4170 991.8817 999.8034 1004.0035 1009.4559 1021.2057 1035.8972 1038.7193 1044.8104 1057.9886 1062.6294 1072.9253 1077.4732 1079.1028 1081.7429 1084.7021 1100.6997 1104.9303 1154.0085 1165.9598 1174.2555 1182.2265 1188.2947 1202.4086 1211.5013 1218.2301 1225.5152 1240.9837 1243.5682 1261.4019 1268.8305 1269.5851 1276.9643 1279.0509 1282.5478 1288.7177 1290.3247 1292.1842 1293.2593 1296.0429 1303.3559 1311.0241 1316.8279 1328.6261 1337.2607 1344.2120 1346.5369 1349.5774 1354.6799 1356.9791 1359.4134 1362.5773 1383.1120 1390.7152 1391.1098 1426.1988 1449.3770 1452.4986 1457.7878 1457.9862 1460.3307 1462.2219 1465.1311 1465.5956 1467.4063 1472.5745 1473.6666 1477.1205 1479.0427 1482.1470 1485.3374 1486.6477 1487.3419 1490.9230 1658.2444 2863.8176 2916.0264 2924.7757 2948.1972 2948.7402 2949.9894 2951.2045 2952.5806 2958.3943 2961.6928 2964.1188 2967.0623 2971.3637 2973.1647 2979.5373 2983.9774 2985.3286 2991.2736 2993.4652 2999.3967 3003.5033 3005.6700 3013.5208 3026.2511 3037.4417 3037.8064 3044.7310 3044.9851 3068.0682 3069.4470 3069.5046 3070.7431 3072.2239 3073.6020 3076.6878 3078.4689 3089.1614 3192.5418
redmass: 4.2672 4.3762 2.9357 2.2683 2.9224 3.4266 1.9464 2.7110 1.8144 2.5193 2.8033 2.3969 2.2988 2.3643 2.4203 2.9852 2.0353 2.1771 2.6274 3.8648 1.8105 2.5073 1.2144 3.5368 2.3692 2.1033 2.3715 2.6498 2.9302 2.9884 2.1273 2.5483 2.4280 2.8254 2.8151 2.8159 4.1366 3.7721 3.7484 1.5366 3.3441 1.0618 1.1051 1.1201 2.6022 1.2469 1.3455 1.3271 1.2822 1.5234 1.4884 2.2750 2.0066 2.6848 1.6374 1.7252 1.7130 1.4635 1.3641 6.8613 3.1149 1.6459 2.4404 2.6189 1.1983 1.8788 1.7894 2.6886 3.4357 1.8499 2.8982 2.3768 2.0006 2.4620 2.0329 2.1336 2.4719 2.1981 2.2779 1.8606 2.2396 1.8900 2.3129 1.8704 1.3502 1.4331 1.3062 1.3645 1.2906 1.3738 1.2643 1.2025 1.3059 1.2565 1.0734 1.1037 1.2157 1.2409 1.1036 1.1063 1.1338 1.2897 1.2816 1.1911 1.3718 1.4546 1.3298 1.3795 1.5108 1.6348 1.6289 1.5059 1.3616 1.7517 1.2171 1.2171 1.1796 1.0777 1.0829 1.0891 1.0838 1.0707 1.0743 1.0800 1.0748 1.0733 1.0731 1.0976 1.0692 1.0426 1.1000 1.0628 1.0472 1.1002 1.0792 4.7226 1.0823 1.0684 1.0686 1.0604 1.0591 1.0590 1.0613 1.0601 1.0606 1.0585 1.0636 1.0612 1.0597 1.0374 1.0371 1.0955 1.0660 1.0971 1.0927 1.0619 1.0965 1.1006 1.0989 1.1012 1.1019 1.1037 1.1034 1.0958 1.1029 1.1002 1.0801 1.0975 1.0993 1.0960 1.0951 1.0969 1.0736 1.1144
irintensity: 0.0120 0.0713 0.0395 0.0669 0.1200 0.0664 0.0607 0.0168 0.0528 0.2053 0.2655 0.2184 0.1741 0.1666 0.2495 0.0581 0.0749 0.3082 0.8635 1.9542 1.3125 2.7144 0.7105 0.8210 0.8996 0.3855 2.3033 1.7950 0.7982 6.1192 1.8356 0.8260 1.3294 0.6536 1.1047 4.5490 2.8392 1.3220 3.2844 16.2471 5.6777 13.5532 1.9393 6.3512 5.1204 0.7176 8.0509 14.4875 8.6323 12.7641 21.3116 15.1369 2.8606 31.9035 3.7052 6.6240 12.3328 4.9238 70.9521 19.4623 28.4131 6.8081 0.3794 19.1473 27.6213 12.7771 40.1719 2.7998 15.1789 0.5239 3.4803 18.8013 16.8696 16.0274 10.8506 6.8157 42.2380 38.5021 15.0368 31.6502 1.2392 1.6018 4.7327 2.6943 16.8608 4.8305 1.7969 0.9086 2.7225 0.9036 1.0488 0.6297 1.0407 1.1930 0.3802 3.6206 2.5103 2.1372 0.6890 1.9999 0.4063 0.8804 3.7461 1.3023 2.4107 2.6994 3.6445 5.4395 2.3487 1.8388 2.7578 4.2335 8.1403 30.2473 16.9673 10.9561 3.4447 4.5454 4.2318 4.8520 3.6222 0.0946 1.0903 0.6754 0.4514 5.1825 17.4663 2.3530 13.3857 12.3233 2.0757 12.4743 8.1034 28.1707 5.4464 22.7322 70.4761 20.2009 92.0306 41.1281 0.9056 1.7984 9.1270 8.8774 13.9929 9.7149 19.7353 174.5551 51.3974 46.1684 32.3634 4.3277 23.5077 1.9897 26.6430 20.0205 11.4409 0.7972 2.6384 6.4184 4.0355 56.7118 170.1423 1.5836 54.1730 65.7011 64.0945 46.9337 53.6167 40.2893 50.1313 46.5841 7.7034 33.8350
temp: 298.150 k
press: 1.00000 atm
elementType: 8 8 6 6 6 6 6 6 6 6 6 6 6 6 6 6 6 6 6 6 6 6 1 1 1 1 1 1 1 1 1 1 1 1 1 1 1 1 1 1 1 1 1 1 1 1 1 1 1 1 1 1 1 1 1 1 1 1 1 1
symmnumber: 1
zpe: 1418720.9 jmol-1
zpe.correction: 0.540362 hartree
zpe.thermalcorrener: 0.567905 hartree
zpe.thermalcorrenthalpy: 0.568849 hartree
zpe.thermalcorrgfe: 0.478120 hartree
zpe.sumelectzpe: -933.520428 hartree
zpe.sumelectthermal: -933.492885 hartree
zpe.sumelectthermalent: -933.491940 hartree
zpe.sumelectthermalfe: -933.582669 hartree
dipole: -2.1938 -0.7887 1.4449
dipole: 2.7428
quadrupole: -137.5340 -138.5629 -142.5676
quadrupole: -1.4646 -5.6180 -0.8492
quadrupole: 2.0208 0.9919 -3.0127 -1.4646 -5.6180 -0.8492
hfenergy: -934.0607899 hartree
pointgroup: C01 [X(C20H38O2)]
dipole: 0.851646 -0.4151032 -0.5165314 debye
polarizability: 302.0860029|-17.8039213|191.9166907|-1.5646179|-3.7043505|182.3513753 unknown
InChI: InChI=1S/C20H38O2/c1-4-7-9-10-11-12-13-14-15-19-21-17-20(6-3,18-22-19)16-8-5-2/h4,19H,1,5-18H2,2-3H3
charge 0 multiplicity 1
60 atoms
O  1.760447 0.359928 -0.35247
O  2.382609 -1.152661 1.421088
C  4.201554 -0.096318 0.043497
C  5.49893 -0.439918 -0.746436
C  3.08091 0.206075 -0.993538
C  3.725043 -1.34874 0.835249
C  4.380331 1.094782 1.032749
C  1.403154 -0.861149 0.373617
C  6.74918 -0.764793 0.105051
C  0.046465 -0.656619 1.033511
C  4.90283 2.40983 0.415384
C  -1.113132 -0.542998 0.019831
C  7.981672 -1.097671 -0.767677
C  -2.475125 -0.314282 0.711845
C  -3.664362 -0.272492 -0.27354
C  9.239463 -1.420794 0.067069
C  -5.023281 -0.039918 0.424802
C  -6.222815 -0.040543 -0.549179
C  -7.578604 0.183331 0.157306
C  -8.782322 0.161971 -0.822893
C  -10.114792 0.309443 -0.119238
C  -11.031531 1.280857 -0.359606
H  5.741906 0.407187 -1.42113
H  5.290776 -1.305844 -1.412027
H  3.0325 -0.620484 -1.739897
H  3.257002 1.154172 -1.527145
H  4.37877 -1.563858 1.695756
H  3.704272 -2.236157 0.160544
H  5.067505 0.777094 1.84252
H  3.402306 1.278562 1.513925
H  1.406219 -1.711133 -0.356492
H  6.544548 -1.623502 0.776262
H  6.99437 0.094141 0.760984
H  0.107727 0.257335 1.653677
H  -0.124678 -1.508671 1.718457
H  5.908357 2.291566 -0.029232
H  4.975101 3.19269 1.192514
H  4.226399 2.794385 -0.369636
H  -0.901556 0.286217 -0.682142
H  -1.164899 -1.470176 -0.58941
H  7.740837 -1.957515 -1.42601
H  8.192022 -0.241227 -1.440782
H  -2.438647 0.635548 1.285032
H  -2.648555 -1.11939 1.456997
H  -3.493754 0.527726 -1.023645
H  -3.703018 -1.226392 -0.840545
H  -4.993955 0.925883 0.971198
H  -5.177433 -0.826029 1.193773
H  9.066978 -2.295241 0.722601
H  9.515611 -0.566982 0.714239
H  10.106945 -1.649379 -0.578889
H  -6.250421 -1.006702 -1.096026
H  -6.073942 0.746534 -1.317717
H  -7.723235 -0.600102 0.930335
H  -7.565835 1.152801 0.694361
H  -8.762486 -0.802076 -1.37558
H  -8.664403 0.964028 -1.577665
H  -10.329518 -0.445094 0.655423
H  -11.976937 1.331125 0.192672
H  -10.860305 2.055438 -1.118017
