program: Gaussian 09
title: 000228900
version: EM64L-G09RevD.01
frameworkgroup: C1[X(C9H14O6)]
method: RPBEPBE
basis: SDD
operation: Freq
keyword: #pfreq=noraman
keyword: PBEPBE/SDD
title: #p freq=noraman PBEPBE/SDD
converged: YES YES NO NO
title: Mulliken charges:
elementType: O O O O O O C C C C C C C C C H H H H H H H H H H H H H H
charge: -0.276675 -0.276674 -0.267844 -0.267846 -0.250158 -0.250154 0.332786 -0.559666 -0.559670 -0.321389 -0.321392 0.285882 0.285879 -0.507340 -0.507339 0.256890 0.304753 0.256893 0.304757 0.214225 0.235541 0.214225 0.235542 0.244274 0.233099 0.242014 0.244273 0.233098 0.242015
chargesum: 0.00000
title: Mulliken charges with hydrogens summed into heavy atoms:
elementType: O O O O O O C C C C C C C C C
charge: -0.276675 -0.276674 -0.267844 -0.267846 -0.250158 -0.250154 0.332786 0.001977 0.001980 0.128377 0.128375 0.285882 0.285879 0.212048 0.212047
polarizability: 1.36884278e+02 -5.81692720e-04 1.16793061e+02 -3.71645828e+00 4.04754531e-04 9.30344477e+01
1716.lowfreq: -10.3664 -7.0908 -5.3143 -0.0012 -0.0012 -0.0008 11.1845 18.8482 38.5913
frequency: 9.4406 18.7517 38.3349 53.9160 70.6036 90.1945 92.1871 122.2096 142.3833 171.3608 180.1845 222.4992 234.3735 283.0529 290.2603 308.9128 328.3013 373.8850 374.6892 520.5820 550.7689 578.7502 613.5685 644.1938 681.6614 699.2384 768.4817 775.9202 840.2018 853.6726 868.6611 892.5886 923.4862 960.6672 980.5435 980.7832 994.4027 999.6465 1061.5606 1094.8831 1107.0939 1113.0108 1113.2137 1149.2976 1149.3441 1159.6719 1181.0339 1192.9633 1196.4855 1248.1950 1268.5590 1312.0101 1326.4837 1335.5625 1345.5643 1421.8769 1421.9785 1425.7381 1427.4580 1451.7908 1451.8166 1463.8130 1463.8536 1472.5561 1477.1059 1636.8122 1644.3153 2987.8069 2993.8097 3005.3067 3005.6869 3006.6596 3008.0623 3095.3159 3101.8990 3103.7617 3104.0540 3108.3124 3108.3390 3149.9206 3149.9458
redmass: 3.9920 4.3536 4.3742 4.9458 3.1588 1.1772 1.2068 3.7699 4.0718 3.2170 3.9968 4.8338 2.7354 4.7540 3.3644 3.6440 5.7964 3.0243 3.3227 5.5256 3.5103 3.3516 2.3102 5.3061 5.4288 7.0096 4.8895 3.8559 5.7904 3.3616 2.6773 3.6097 2.6909 5.0694 3.2440 4.6737 3.2153 3.9168 2.2784 2.5724 1.6588 1.2713 1.2690 1.4450 1.4440 1.1412 3.5089 2.7686 1.3326 1.3832 1.8192 1.4038 1.2499 1.5555 1.7665 1.1962 1.2006 1.0854 1.0821 1.0500 1.0500 1.0505 1.0505 1.0885 1.0970 9.1928 8.7676 1.0702 1.0615 1.0348 1.0371 1.0562 1.0584 1.0979 1.0977 1.1012 1.0964 1.1046 1.1046 1.1050 1.1050
irintensity: 4.0285 1.3259 5.2238 1.2133 1.5435 0.3901 0.2454 0.0016 4.7009 8.2028 6.0134 0.0000 1.7899 0.8611 62.0537 0.4831 8.4268 10.2627 0.9293 22.7647 1.0139 15.2546 1.3528 0.4931 18.4287 18.1629 0.5634 11.9512 0.4512 13.6851 15.0238 2.0017 47.5302 56.6322 62.7522 14.0816 16.0385 62.0238 156.0889 360.6305 7.5052 0.0010 0.3574 20.0746 3.3426 1.0795 0.4801 262.7234 16.5204 13.9816 1.9634 109.0484 7.6525 108.6862 88.1982 19.8952 33.5892 73.0172 0.1078 12.5818 15.7146 22.8141 0.5118 9.1413 1.3917 60.5547 259.2702 51.0482 56.7722 88.6899 7.9222 12.1209 17.6669 25.3280 3.7286 30.5722 1.0193 19.2112 30.7600 33.1773 1.1174
temp: 298.150 k
press: 1.00000 atm
elementType: 8 8 8 8 8 8 6 6 6 6 6 6 6 6 6 1 1 1 1 1 1 1 1 1 1 1 1 1 1
symmnumber: 1
zpe: 595598.5 jmol-1
zpe.correction: 0.226851 hartree
zpe.thermalcorrener: 0.243548 hartree
zpe.thermalcorrenthalpy: 0.244493 hartree
zpe.thermalcorrgfe: 0.178561 hartree
zpe.sumelectzpe: -801.492787 hartree
zpe.sumelectthermal: -801.476090 hartree
zpe.sumelectthermalent: -801.475146 hartree
zpe.sumelectthermalfe: -801.541077 hartree
dipole: -0.0002 2.2913 -0.0002
dipole: 2.2913
quadrupole: -69.0381 -74.6031 -95.0362
quadrupole: 0.0003 -2.1152 -0.0001
quadrupole: 10.5210 4.9561 -15.4771 0.0003 -2.1152 -0.0001
hfenergy: -801.7196386 hartree
pointgroup: C01 [X(C9H14O6)]
dipole: -0.9014742 0.000086 0.0001174 debye
polarizability: 116.7930595|0.0005952|131.41416|-0.0068628|-14.9583953|98.5045668 unknown
InChI: InChI=1S/C9H14O6/c1-12-7(10)5-9(6-8(11)13-2)14-3-4-15-9/h3-6H2,1-2H3
charge 0 multiplicity 1
29 atoms
O  -1.486058 0.958898 0.703809
O  -1.486687 -0.958494 -0.703135
O  1.102629 -2.895809 1.488287
O  1.103309 2.895115 -1.488599
O  1.758696 -1.859792 -0.485327
O  1.759405 1.859087 0.484996
C  -0.593856 0.000014 0.000192
C  0.220271 -0.712075 1.096614
C  0.220208 0.711766 -1.096495
C  -2.851584 0.750282 0.170977
C  -2.851939 -0.749344 -0.169811
C  1.095257 -1.837311 0.577966
C  1.095755 1.836716 -0.578166
C  1.965924 -4.046698 1.123135
C  1.967093 4.045736 -1.123755
H  -0.466793 -1.104024 1.862096
H  0.87541 0.044211 1.570698
H  -0.466944 1.103936 -1.861786
H  0.874932 -0.044768 -1.57076
H  -3.01806 1.373483 -0.729421
H  -3.555712 1.035979 0.967895
H  -3.018338 -1.372481 0.730645
H  -3.556465 -1.034763 -0.966478
H  1.636775 -4.478093 0.163173
H  1.839694 -4.762795 1.946931
H  3.016234 -3.722436 1.033102
H  1.63828 4.47737 -0.163784
H  1.840966 4.761777 -1.947616
H  3.017302 3.721106 -1.03388
