program: Gaussian 09
title: 000228897
version: EM64L-G09RevD.01
frameworkgroup: C1[X(C7H11NO2)]
method: RPBEPBE
basis: SDD
operation: Freq
keyword: #p
keyword: freq=noraman
keyword: PBEPBE/SDD
title: #p freq=noraman PBEPBE/SDD
converged: NO YES NO NO
title: Mulliken charges:
elementType: O O N C C C C C C C H H H H H H H H H H H
charge: -0.291674 -0.250864 -0.626919 0.420173 -0.304275 -0.485245 -0.514758 -0.454433 -0.425900 0.257886 0.204021 0.210762 0.274808 0.243851 0.217021 0.222888 0.217301 0.222331 0.209313 0.337068 0.316646
chargesum: 0.00000
title: Mulliken charges with hydrogens summed into heavy atoms:
elementType: O O N C C C C C C C
charge: -0.291674 -0.250864 0.026795 0.420173 -0.100254 0.000325 -0.053886 -0.014245 0.005744 0.257886
polarizability: 1.05737618e+02 -4.68878479e+00 8.21277287e+01 -4.50569794e+00 2.99021926e+00 6.49481541e+01
1716.lowfreq: -9.9247 -0.0008 -0.0006 0.0005 7.6505 11.4870 29.4332 46.5675 136.0229
frequency: 28.7071 46.4459 136.0214 150.6990 227.2592 283.5491 341.5817 391.1729 397.8592 481.8976 501.1307 554.2941 593.9489 605.5589 692.8924 712.6836 749.9450 816.4397 852.2496 855.1561 902.0061 904.2792 920.0095 962.3823 1015.9662 1041.0488 1049.4438 1055.9252 1143.7879 1155.5863 1180.9474 1213.7181 1229.8891 1258.7990 1273.1692 1284.0319 1308.4078 1312.2981 1350.0282 1416.8417 1444.7289 1454.0450 1470.7216 1481.3214 1593.2594 1643.3759 2995.2719 3000.3965 3005.2101 3006.8565 3047.8322 3058.4937 3068.7175 3080.1275 3111.5967 3517.1149 3671.9937
redmass: 2.8204 3.8047 3.6432 4.2855 1.7627 5.7895 3.4028 2.9234 3.3585 1.7419 1.7050 1.9658 1.5060 3.1449 2.2733 4.9433 3.4897 2.2106 2.1289 3.4377 2.1966 3.5258 1.6818 1.9403 1.4675 1.5075 2.0247 1.7011 1.4524 1.4634 2.8075 1.4226 1.3185 1.4418 1.4774 1.7133 1.3107 1.4572 2.2867 3.5733 1.1008 1.0855 1.0843 1.1060 1.4850 3.3134 1.0622 1.0651 1.0656 1.0638 1.0890 1.0997 1.1010 1.1039 1.0958 1.0447 1.1043
irintensity: 4.1891 7.7376 4.7792 2.9476 0.5472 2.5750 1.1682 5.3475 5.4029 47.4148 115.1126 7.7865 109.2326 18.5012 3.2203 56.3032 3.6013 11.0888 4.2266 7.5212 2.2162 7.6597 9.1099 9.7583 1.8760 1.4445 2.4916 0.4543 0.8839 4.4586 10.0080 3.8193 21.2799 15.1756 51.3363 43.5598 1.0373 3.6298 14.3987 107.4402 8.3473 9.9825 10.1191 7.7217 67.9141 260.1886 33.6369 31.7233 24.3651 22.4739 31.1222 21.8602 29.4709 60.0115 9.3313 40.7180 26.5981
temp: 298.150 k
press: 1.00000 atm
elementType: 8 8 7 6 6 6 6 6 6 6 1 1 1 1 1 1 1 1 1 1 1
symmnumber: 1
zpe: 454874.8 jmol-1
zpe.correction: 0.173253 hartree
zpe.thermalcorrener: 0.183086 hartree
zpe.thermalcorrenthalpy: 0.184030 hartree
zpe.thermalcorrgfe: 0.137063 hartree
zpe.sumelectzpe: -477.737716 hartree
zpe.sumelectthermal: -477.727883 hartree
zpe.sumelectthermalent: -477.726939 hartree
zpe.sumelectthermalfe: -477.773906 hartree
dipole: 0.3884 -3.1363 -3.2944
dipole: 4.5652
quadrupole: -46.6863 -60.1924 -63.2489
quadrupole: -8.2149 -5.5256 1.8693
quadrupole: 10.0229 -3.4832 -6.5397 -8.2149 -5.5256 1.8693
hfenergy: -477.9109688 hartree
pointgroup: C01 [X(C7H11N1O2)]
dipole: 0.0543807 -0.2508194 1.7776373 debye
dipolederiv: -0.454264 -0.0673 -0.0441186 -0.020064 -0.5211135 -0.1169526 -0.083871 -0.1456948 -0.4436265 -0.6581322 0.1204439 0.0121109 0.0323011 -0.6339213 0.336601 0.1354113 0.2436201 -0.6998338 -0.9825272 -0.2504481 0.386244 -0.0703922 -0.4098015 -0.2017136 0.3354167 -0.0866081 -0.8312627 0.5829101 0.0004533 0.0068133 0.1685698 0.353886 -0.0568443 0.0594534 0.063821 0.2989181 -0.2864035 0.1151731 0.0542368 0.0386151 0.1330481 -0.0111053 -0.027087 -0.0401064 0.2371214 -0.0446274 -0.0060666 -0.0068224 -0.0245251 -0.0369217 0.076188 -0.0659212 0.1438264 -0.0051397 -0.0684584 0.0112012 -0.0526591 0.0001561 -0.016797 0.0636963 -0.0066861 0.0517388 0.0489479 0.0390851 0.0446454 -0.0011946 -0.0511156 0.1033897 0.0784171 -0.0266998 0.0138076 0.1022033 0.0590481 -0.0419845 -0.0208662 0.0531699 0.1069127 0.0903289 0.0001499 0.0696117 0.0586336 1.2889223 -0.0878603 -0.5323146 -0.2803666 0.6224513 -0.3452587 -0.5341602 -0.3800753 0.9770062 0.0014709 0.0145154 0.058677 0.0273324 -0.0191713 0.1083922 0.0618922 0.0995335 -0.0942287 0.0415572 0.0119005 0.0362501 0.0008767 -0.0562095 -0.0807718 0.071947 -0.1105673 -0.0087311 0.043211 0.0251881 -0.0882137 0.0106997 0.0842559 0.0112211 -0.0697852 0.0305625 0.0009998 0.0251269 0.0134023 -0.0068332 0.0269655 -0.0790897 -0.0445745 0.0140102 -0.0950233 0.0511562 0.0268853 -0.037484 0.0620264 -0.0190843 0.0613071 0.0452109 0.0109492 0.0758129 -0.1456013 -0.0261625 -0.1043906 0.0394141 -0.1327848 -0.1113081 0.0763469 0.026267 0.0463587 0.0557764 0.0369761 0.0278933 0.0123695 0.073106 -0.0051442 -0.1354075 0.0377591 -0.0800355 -0.0944825 -0.1769192 0.0840643 -0.0121985 0.1122603 0.0241007 0.0114648 0.0097249 0.0027589 0.0770335 0.0640255 -0.0104106 0.0139739 -0.0682416 -0.0604045 -0.1201423 -0.0318952 -0.0992352 -0.0891919 0.2258591 0.0691102 0.0458726 0.0602822 0.2459806 0.0990644 0.0608057 0.0875679 0.2532864 0.2624167 0.0679535 0.0372322 0.0622394 0.2145505 0.1158389 0.022319 0.1083262 0.2510154 unknown
polarizability: 103.6321101|-1.3608115|73.5282211|-10.5385538|-8.6857304|75.6531701 unknown
InChI: InChI=1S/C7H11NO2/c8-6(9)5-7(10-5)3-1-2-4-7/h5H,1-4,8H2
charge 0 multiplicity 1
21 atoms
O  -0.322011 -1.203742 -0.70291
O  -2.019276 1.331357 -0.588267
N  -3.0031 0.338871 1.26667
C  0.556405 -0.228637 0.061007
C  -0.84443 -0.516459 0.533425
C  0.984361 1.050703 -0.664823
C  1.790806 -0.841192 0.75434
C  2.51146 0.865673 -0.849592
C  2.951018 0.153261 0.459029
C  -1.985215 0.462038 0.329821
H  -0.954664 -1.200384 1.390231
H  0.776373 1.9290 -0.023559
H  0.414974 1.190985 -1.595397
H  1.9900 -1.826424 0.29394
H  1.63253 -1.005365 1.835282
H  3.038656 1.821484 -1.014173
H  2.711088 0.215276 -1.722734
H  3.926425 -0.355179 0.366559
H  3.036417 0.896354 1.275137
H  -3.799561 0.972429 1.199195
H  -3.010958 -0.394148 1.973821
