program: Gaussian 09
title: 000021627
version: EM64L-G09RevD.01
frameworkgroup: C1[X(C10H6N4O2)]
method: RPBEPBE
basis: SDD
operation: Freq
keyword: #p
keyword: freq=noraman
keyword: PBEPBE/SDD
title: #p freq=noraman PBEPBE/SDD
converged: YES YES NO NO
title: Mulliken charges:
elementType: O O N N N N C C C C C C C C C C H H H H H H
charge: -0.435176 -0.218792 -0.050857 -0.071844 0.026298 0.027987 0.158387 0.103769 -0.300395 -0.295678 -0.219922 -0.201550 0.121651 -0.149355 -0.123311 -0.123835 0.283386 0.269959 0.244828 0.245443 0.318232 0.390775
chargesum: 0.00000
title: Mulliken charges with hydrogens summed into heavy atoms:
elementType: O O N N N N C C C C C C C C C C
charge: -0.044400 -0.218792 -0.050857 -0.071844 0.026298 0.027987 0.158387 0.103769 -0.017009 -0.025719 0.024906 0.043892 0.121651 0.168877 -0.123311 -0.123835
polarizability: 2.10859056e+02 -7.81712442e+00 1.49469044e+02 -8.23874118e-01 -1.20574029e+00 8.03921457e+01
1716.lowfreq: -5.1993 -4.2264 -0.4595 -0.0012 -0.0010 -0.0010 17.8354 45.2875 54.7711
frequency: 17.7943 45.2815 54.7682 64.8758 99.5361 116.4397 133.1045 179.0079 218.5761 263.0835 291.0247 306.9917 348.5339 363.2290 405.3124 435.6604 483.0118 504.1751 548.8665 564.9700 571.2698 589.3537 597.3572 642.0407 679.9029 728.2403 774.1165 785.2657 811.6686 883.3166 899.6938 934.0529 974.1024 1000.6513 1004.1384 1013.6323 1037.5006 1104.6438 1160.7617 1177.4700 1181.9776 1220.3631 1267.7703 1282.7033 1318.1666 1387.4501 1401.5013 1429.0851 1469.3351 1579.5765 1592.1728 1631.9722 2206.7592 2215.4086 2979.2352 3144.7462 3159.6078 3172.2978 3186.3504 3531.4344
redmass: 9.3316 9.7884 11.1705 9.1249 7.2126 7.9848 6.2253 7.3569 6.9708 9.3932 9.7477 6.4728 8.1425 8.3059 4.3778 5.2659 6.4681 6.9212 4.8640 12.1723 8.2526 1.4190 3.4230 5.9031 3.6568 4.9077 2.9696 1.7146 6.7612 3.0475 2.1828 4.8214 1.4054 4.0921 1.4634 3.6255 2.3079 2.0208 1.6326 1.2931 1.8073 1.3966 1.5223 1.4136 2.5478 9.8025 8.4651 2.3997 2.5874 7.2439 6.2330 8.8722 12.5931 12.5992 1.0813 1.0867 1.0910 1.0968 1.0977 1.0643
irintensity: 0.6234 0.4285 1.2960 0.9490 5.1346 1.8672 2.5752 7.9470 0.5995 5.0171 2.2821 1.6863 4.4560 0.0732 9.0735 7.5717 4.2190 25.9016 6.8516 1.7507 3.4786 85.3331 50.7286 4.5914 69.7861 10.0427 40.0140 41.4058 0.7580 1.2498 7.8356 11.8067 10.6564 248.2930 20.3516 16.8285 4.7010 63.2014 75.8473 5.5267 2.9360 2.2019 1.8270 2.8752 89.1695 11.6009 15.8129 5.3820 12.6091 19.0084 30.7387 173.6747 3.2907 0.7617 6.0462 2.2145 6.2003 6.8698 6.7839 58.8325
temp: 298.150 k
press: 1.00000 atm
elementType: 8 8 7 7 7 7 6 6 6 6 6 6 6 6 6 6 1 1 1 1 1 1
symmnumber: 1
zpe: 377848.5 jmol-1
zpe.correction: 0.143915 hartree
zpe.thermalcorrener: 0.158412 hartree
zpe.thermalcorrenthalpy: 0.159356 hartree
zpe.thermalcorrgfe: 0.100032 hartree
zpe.sumelectzpe: -752.911446 hartree
zpe.sumelectthermal: -752.896949 hartree
zpe.sumelectthermalent: -752.896004 hartree
zpe.sumelectthermalfe: -752.955328 hartree
dipole: 6.8829 -0.7872 -0.9125
dipole: 6.9876
quadrupole: -98.0463 -82.8564 -99.6325
quadrupole: -3.3341 5.2356 -10.0928
quadrupole: -4.5346 10.6554 -6.1208 -3.3341 5.2356 -10.0928
hfenergy: -753.0553605 hartree
pointgroup: C01 [X(C10H6N4O2)]
dipole: -2.7310996 -0.1048782 -0.2963744 debye
dipolederiv: -0.8776266 -0.6052598 -0.20793 -0.5627741 -0.7675119 -0.1794671 -0.228093 -0.2441755 -0.5067131 -0.8124964 0.0159052 -0.1215004 0.1729824 -0.816221 -0.0471043 -0.0761096 -0.0873905 -0.3252064 0.3660655 0.0082962 -0.0036914 0.2433508 -0.0070033 -0.0049183 0.0226766 0.0369548 -0.0838297 0.0610838 0.0049646 -0.0636037 -0.4739461 -0.1170932 0.133504 -0.4418586 0.0085098 -0.1199036 -0.154673 0.0321574 -0.004703 -0.0773347 -0.1374444 -0.0015525 0.0347879 -0.0357827 -0.1821988 -0.16234 0.0037401 0.0422827 0.0066414 -0.1794329 -0.0249929 -0.0264673 -0.0119166 -0.1231831 0.1184757 0.1016915 -0.0092057 0.0395419 -0.5406452 -0.0983025 0.1113236 -0.1602457 -0.0248468 -0.1160914 0.1501878 -0.0108607 0.0106736 0.1935506 0.0055841 0.1338672 0.043875 0.0561397 -0.1183844 -0.05137 -0.0148872 0.2615873 0.0577588 0.0083844 0.0626575 0.0314737 -0.0993322 -0.1044614 0.1395936 0.0288206 0.0380924 -0.1039828 -0.0285208 -0.1678133 -0.0145122 -0.0941034 0.0970603 -0.0885157 -0.0378728 -0.1863786 -0.1204916 0.0228905 -0.0545393 -0.0119615 -0.1334493 -0.0238242 -0.0640259 -0.0365882 -0.0467666 0.1687564 0.0582257 -0.0448431 0.0702887 -0.0970667 1.3313468 0.2681786 0.3295333 0.2338566 1.623783 0.2951968 0.3055133 0.3831679 0.3787141 0.2687935 -0.016169 0.0587023 -0.0600205 0.3729676 -0.0308645 0.0886476 -0.0132244 0.4098576 -0.1920948 0.007289 -0.0280041 0.2557465 0.0019129 -0.0315198 -0.0507263 -0.008814 -0.0439838 -0.1011372 -0.0228687 0.0262315 -0.0256993 -0.0498591 0.003515 0.1741949 0.0335868 -0.0514684 0.0414884 -0.0508132 0.0027231 -0.0538912 0.0701129 -0.0064162 -0.0211903 0.0165167 0.1624893 0.0427185 -0.0755032 0.0164212 -0.0542209 0.0652753 -0.0086102 0.0543034 -0.0202462 0.1460405 -0.071444 0.0577425 0.0333915 0.0475868 0.0746307 -0.0193241 0.0352781 -0.0254683 0.1532641 0.0743805 0.0312144 0.0172656 0.0493837 -0.0667292 -0.0485873 0.0412449 -0.0304274 0.1451918 0.0548686 -0.0200463 -0.0187192 0.0644058 0.0394665 0.0084206 0.0433551 0.0078815 0.0320526 0.2782918 0.1736108 0.0021945 0.1171827 0.2381999 -0.0055405 0.0037906 0.0319101 0.4015358 unknown
polarizability: 211.7454204|1.8562325|148.5166024|-2.4121511|1.8104721|80.4582225 unknown
InChI: InChI=1S/C10H6N4O2/c11-5-7(6-12)13-14-9-4-2-1-3-8(9)10(15)16/h1-4,7,15H
charge 0 multiplicity 1
22 atoms
O  -2.825697 -2.698118 -0.624388
O  -0.569471 -2.538609 -0.098003
N  0.394693 -0.001506 -0.32068
N  1.359117 0.57637 0.31602
N  3.686117 2.173145 -1.69547
N  4.311068 -0.674078 1.677457
C  -1.986134 -0.539602 -0.010118
C  -0.924796 0.413831 0.064182
C  -3.316768 -0.106296 0.204605
C  -1.20441 1.769683 0.372466
C  -3.592121 1.24508 0.504551
C  -2.533782 2.18035 0.594354
C  -1.682813 -1.979659 -0.236435
C  2.704784 0.12112 -0.298359
C  3.270174 1.253297 -1.062276
C  3.60278 -0.305857 0.793618
H  -4.122064 -0.842893 0.14536
H  -0.374928 2.483014 0.406943
H  -4.62507 1.567421 0.669481
H  -2.746266 3.228512 0.82934
H  2.517927 -0.729342 -0.98752
H  -2.579838 -3.655361 -0.737628
