program: Gaussian 09
title: 000021634
version: EM64L-G09RevD.01
frameworkgroup: C1[X(C13H21NO)]
method: RPBEPBE
basis: SDD
operation: Freq
keyword: #p
keyword: freq=noraman
keyword: PBEPBE/SDD
title: #p freq=noraman PBEPBE/SDD
converged: YES YES NO NO
title: Mulliken charges:
elementType: O N C C C C C C C C C C C C C H H H H H H H H H H H H H H H H H H H H H
charge: -0.276373 -0.110055 -0.402455 -0.324199 -0.328449 -0.290363 -0.671191 -0.670955 0.236137 0.305705 -0.356529 -0.386919 -0.786110 -0.242052 -0.248118 0.215401 0.220774 0.205082 0.189606 0.207549 0.191341 0.222219 0.204415 0.210867 0.226864 0.207525 0.208649 0.225746 0.208380 0.247720 0.229693 0.236166 0.236166 0.211841 0.222223 0.223700
chargesum: 0.00000
title: Mulliken charges with hydrogens summed into heavy atoms:
elementType: O N C C C C C C C C C C C C C
charge: -0.276373 -0.110055 0.033720 0.070488 0.070441 0.136271 -0.025935 -0.028180 0.236137 0.305705 -0.108809 -0.157226 -0.101937 -0.019828 -0.024418
polarizability: 1.98201760e+02 3.97275985e+00 1.48113970e+02 2.02603806e+00 1.39861991e+01 1.12913368e+02
1716.lowfreq: -7.3297 -3.9121 -0.0006 -0.0005 0.0005 8.4495 19.9474 29.9974 49.8858
frequency: 19.8537 29.8931 49.7713 68.1915 87.0849 94.3296 118.5517 143.9584 172.4006 176.0691 187.8571 227.4500 249.8816 266.9133 289.1012 302.6688 336.5414 397.6184 441.9896 443.0527 470.8717 501.3561 530.9145 542.7359 591.5820 717.3671 728.2765 755.0621 765.8202 796.0854 796.1661 810.2195 822.5418 848.6552 915.3203 925.9588 969.5643 973.9817 983.6756 990.9514 1046.6913 1047.9445 1061.9534 1064.6852 1076.1371 1085.2565 1094.5551 1116.5783 1123.8882 1163.3338 1171.1247 1191.9847 1208.0861 1232.6170 1236.7172 1279.0626 1285.9843 1287.5580 1290.8810 1329.0121 1362.2826 1367.1928 1380.3489 1386.6911 1387.2355 1393.1974 1398.7669 1428.8654 1456.9798 1461.0509 1463.5616 1469.8178 1471.2253 1476.4308 1480.2629 1485.8325 1487.2561 1491.0722 1492.6018 1595.8880 1608.6430 2853.6143 2862.3135 2914.7273 2963.0226 2980.6220 2981.7614 2984.0609 3019.3326 3028.7536 3038.5147 3058.2373 3063.9584 3074.6802 3077.0880 3089.0600 3091.1506 3091.6676 3121.6676 3132.8215 3153.9823 3167.7598
redmass: 3.5679 3.5632 3.2661 3.3225 2.0313 2.4204 1.0890 2.2114 1.9398 3.1975 1.7443 1.3240 2.3617 3.8515 1.9955 2.3480 2.7535 2.9876 2.7836 2.8662 2.9633 3.7927 4.6303 3.4473 6.7517 2.3183 3.7751 1.4910 3.0693 1.1337 1.2492 1.4964 2.5855 1.3366 1.8663 1.3687 1.3095 6.0902 1.6661 2.2366 1.5287 2.0706 2.6720 1.6745 1.8519 2.2219 2.8172 1.8696 1.7169 1.4127 1.1051 2.4646 2.2494 2.8710 1.7232 1.1209 1.3731 1.2767 1.2191 1.3272 1.3440 1.3790 2.6452 1.2365 1.2410 1.7113 1.4035 1.9774 1.0460 1.0613 1.0534 1.1120 1.1100 1.2141 1.0887 1.1306 1.1759 1.3109 1.2488 6.8703 6.1633 1.0721 1.0714 1.0704 1.0569 1.0362 1.0358 1.0356 1.0881 1.1021 1.0873 1.0968 1.0947 1.0979 1.0983 1.1002 1.1004 1.1003 1.0863 1.0893 1.0939 1.0990
irintensity: 0.1577 0.0126 0.1210 0.4425 0.2646 0.1317 0.1706 3.3104 2.3517 1.7516 0.9907 0.0052 4.6844 1.3467 1.6772 0.5915 0.1411 5.2211 1.4260 5.3806 2.4206 11.5762 4.5598 0.2262 4.8814 12.7144 13.1775 88.1386 0.7831 3.9606 8.5419 1.0935 6.2540 0.1530 0.2501 1.6240 0.0429 88.6111 8.3123 8.2108 7.5607 20.0810 27.6343 31.9395 14.7210 3.4213 12.6862 75.1229 7.8426 8.7441 8.9286 74.0487 34.8808 142.7568 35.8942 0.8310 2.4975 15.1138 17.9603 3.2805 1.5218 5.4490 0.6259 22.2426 20.1401 7.2211 15.5957 25.3309 12.9656 3.2289 11.1092 10.8140 22.1767 12.0047 28.5736 14.4995 40.4007 7.4838 33.6732 10.7957 42.0219 33.1131 173.1371 68.8494 42.5289 30.2445 31.2264 30.0470 18.8456 21.1387 14.4272 17.7719 39.2770 55.2387 70.2943 25.0887 31.9642 50.4784 7.5631 15.2613 39.1619 14.6008
temp: 298.150 k
press: 1.00000 atm
elementType: 8 7 6 6 6 6 6 6 6 6 6 6 6 6 6 1 1 1 1 1 1 1 1 1 1 1 1 1 1 1 1 1 1 1 1 1
symmnumber: 1
zpe: 820807.7 jmol-1
zpe.correction: 0.312629 hartree
zpe.thermalcorrener: 0.329646 hartree
zpe.thermalcorrenthalpy: 0.330590 hartree
zpe.thermalcorrgfe: 0.266150 hartree
zpe.sumelectzpe: -636.754239 hartree
zpe.sumelectthermal: -636.737222 hartree
zpe.sumelectthermalent: -636.736277 hartree
zpe.sumelectthermalfe: -636.800718 hartree
dipole: -1.8698 0.0716 -0.3253
dipole: 1.8992
quadrupole: -85.6895 -89.4758 -94.3075
quadrupole: 0.5630 1.1529 1.4917
quadrupole: 4.1347 0.3485 -4.4832 0.5630 1.1529 1.4917
hfenergy: -637.0668678 hartree
pointgroup: C01 [X(C13H21N1O1)]
dipole: -0.7342024 -0.0562364 0.1268823 debye
polarizability: 198.2476841|-2.8123732|143.1433844|-3.3220804|18.5236605|117.8380295 unknown
InChI: InChI=1S/C13H21NO/c1-4-14(5-2)10-11-15-13-9-7-6-8-12(13)3/h6-9H,4-5,10-11H2,1-3H3
charge 0 multiplicity 1
36 atoms
O  0.566233 0.612378 0.334693
N  -3.113801 0.034176 0.068035
C  -1.843954 0.721976 0.409611
C  -4.205957 0.964146 -0.32356
C  -3.521895 -0.958378 1.100079
C  -0.650136 -0.080811 -0.124657
C  -4.00822 1.559775 -1.730444
C  -4.407262 -2.087045 0.538456
C  1.812414 0.080288 -0.045452
C  2.946656 0.807686 0.42433
C  1.963384 -1.085996 -0.833307
C  4.227952 0.324809 0.077437
C  2.754869 2.054362 1.263426
C  3.261084 -1.54237 -1.162671
C  4.397482 -0.840696 -0.709637
H  -1.722363 0.873884 1.507109
H  -1.825818 1.724076 -0.053164
H  -5.151878 0.393032 -0.314608
H  -4.327756 1.789608 0.4231
H  -2.60042 -1.408682 1.515127
H  -4.041153 -0.461101 1.958694
H  -0.682553 -0.117553 -1.231066
H  -0.662854 -1.119309 0.265542
H  -3.076724 2.150777 -1.800614
H  -3.955818 0.752196 -2.481191
H  -4.849032 2.230818 -1.987861
H  -5.362093 -1.703053 0.136203
H  -3.881634 -2.611746 -0.278355
H  -4.65018 -2.817581 1.332621
H  1.089858 -1.638123 -1.192217
H  5.108397 0.874556 0.431815
H  2.168004 2.8158 0.717101
H  2.188008 1.831242 2.186143
H  3.726714 2.494722 1.544888
H  3.375512 -2.445236 -1.773079
H  5.403434 -1.191528 -0.96333
