program: Gaussian 09
title: 000228885
version: EM64L-G09RevD.01
frameworkgroup: C1[X(C22H16)]
method: RPBEPBE
basis: SDD
operation: Freq
keyword: #p
keyword: freq=noraman
keyword: PBEPBE/SDD
title: #p freq=noraman PBEPBE/SDD
converged: YES YES NO NO
title: Mulliken charges:
elementType: C C C C C C C C C C C C C C C C C C C C C C H H H H H H H H H H H H H H H H
charge: 0.184610 0.069033 0.162794 0.307381 -0.401458 0.272801 0.251869 -0.464872 -0.328841 -0.445746 -0.267944 -0.386921 -0.385327 -0.409561 -0.410479 -0.239781 -0.230570 -0.227091 -0.237689 -0.230203 -0.244330 -0.244734 0.271840 0.248175 0.254948 0.243264 0.223572 0.257430 0.256601 0.273854 0.274070 0.222784 0.228470 0.228273 0.230123 0.231623 0.231324 0.230706
chargesum: 0.00000
title: Mulliken charges with hydrogens summed into heavy atoms:
elementType: C C C C C C C C C C C C C C C C C C C C C C
charge: 0.184610 0.069033 0.162794 0.307381 -0.129618 0.272801 0.251869 -0.216698 -0.073893 -0.202482 -0.044371 -0.129491 -0.128726 -0.135707 -0.136409 -0.016997 -0.002100 0.001182 -0.007565 0.001420 -0.013006 -0.014028
polarizability: 3.77678830e+02 1.09070637e+01 2.79465225e+02 -3.44682019e+00 -1.55038351e+00 1.35172046e+02
1716.lowfreq: -4.3374 -0.0004 -0.0002 0.0007 4.2351 6.1246 40.7737 42.3895 62.3485
frequency: 40.7649 42.3890 62.3469 68.6124 76.5144 85.9804 162.8022 184.2154 208.8262 249.5620 257.7462 279.1349 309.3785 322.2646 404.5312 410.2837 422.3192 442.2598 457.1518 495.5310 543.2169 563.6918 595.8731 602.1726 614.6434 618.4506 630.5286 673.0584 690.5446 704.2425 706.6482 736.8017 747.1201 762.4159 765.2430 784.7750 808.7963 848.5815 854.9304 857.0829 859.8561 880.7938 903.2527 930.0424 933.4841 938.5423 949.1626 979.7594 982.2849 984.2665 987.9040 988.8427 997.7320 998.2818 1021.3677 1025.3011 1029.0211 1058.4490 1072.5296 1084.3484 1086.6117 1118.0625 1166.4900 1172.5951 1173.1682 1177.7801 1191.0345 1193.5288 1202.1550 1228.2767 1280.9432 1299.8149 1318.8568 1325.2426 1339.5175 1370.5630 1374.9889 1399.6218 1431.7254 1432.2787 1445.5332 1453.5923 1476.7269 1480.7037 1521.9839 1566.1510 1576.4810 1581.6516 1587.5574 1602.9919 1606.8307 1610.5952 3121.9688 3124.9389 3125.2505 3132.3266 3132.7650 3134.8374 3144.8258 3145.2123 3152.6685 3153.3143 3153.7116 3166.1482 3166.4151 3169.6341 3174.2242 3207.7371
redmass: 4.6420 4.2608 4.4403 4.6319 4.6316 3.9556 4.7461 5.3305 4.2835 4.3664 4.7177 5.8325 4.3223 4.5269 2.8499 2.8858 2.9355 4.2624 3.8291 3.7731 6.7479 3.1985 4.8968 5.7791 6.4058 5.9550 5.4176 6.1312 3.5166 1.7534 1.5571 4.9269 2.2661 1.5317 1.7787 2.1038 1.8639 4.6302 2.4650 1.6147 1.2690 1.4777 4.2312 1.4246 1.4506 1.4229 1.4352 1.3387 1.4116 1.4153 5.4180 5.4345 1.3135 1.3161 2.5715 2.3068 2.0770 2.2926 1.8419 1.6095 1.6626 1.3665 1.3181 1.0541 1.0543 1.7796 1.1250 1.1282 2.3493 2.7109 2.0224 2.0484 1.3889 1.6844 2.2121 6.1729 6.9661 3.5721 2.3311 2.3158 2.6484 3.3562 2.2421 2.3435 5.1411 8.0560 5.7576 6.5857 6.4423 5.9584 6.1555 7.0326 1.0852 1.0847 1.0847 1.0878 1.0878 1.0907 1.0926 1.0924 1.0962 1.0962 1.0964 1.1015 1.1014 1.0968 1.0899 1.1032
irintensity: 0.1199 0.0292 0.4974 0.3844 0.2845 0.0361 0.1003 0.2118 2.1375 2.2022 1.1215 0.5929 0.8750 0.2890 0.3636 0.9848 6.8895 1.1787 3.4331 0.4129 1.5362 2.6161 6.0587 8.4139 0.0569 1.9191 13.4673 6.4484 3.2946 33.5410 67.8947 14.8484 5.0984 75.2701 59.7598 18.5829 33.0382 1.3958 6.6310 0.9778 0.9084 7.6240 3.4544 0.9095 0.9733 1.7501 3.5543 0.5460 1.4946 1.3113 1.3856 1.3424 0.0162 0.1422 4.8016 6.5590 8.9778 7.1880 6.7249 11.0923 8.1037 6.3521 0.5473 0.0351 0.0359 0.8432 1.9154 3.3370 11.5227 0.5707 13.2562 5.9532 0.7081 8.7201 6.7595 1.2662 0.6282 9.0515 17.6406 14.5588 24.9399 63.5597 21.8492 10.1669 7.9582 46.9912 2.2078 7.2917 3.6600 0.3968 7.8489 7.4024 0.8260 2.4168 1.0647 2.3804 2.2273 14.4542 29.2861 9.2998 59.4217 26.3693 15.9275 30.3204 20.4583 21.1744 4.0848 10.4538
temp: 298.150 k
press: 1.00000 atm
elementType: 6 6 6 6 6 6 6 6 6 6 6 6 6 6 6 6 6 6 6 6 6 6 1 1 1 1 1 1 1 1 1 1 1 1 1 1 1 1
symmnumber: 1
zpe: 794898.7 jmol-1
zpe.correction: 0.302761 hartree
zpe.thermalcorrener: 0.319536 hartree
zpe.thermalcorrenthalpy: 0.320480 hartree
zpe.thermalcorrgfe: 0.257474 hartree
zpe.sumelectzpe: -846.460650 hartree
zpe.sumelectthermal: -846.443875 hartree
zpe.sumelectthermalent: -846.442931 hartree
zpe.sumelectthermalfe: -846.505937 hartree
dipole: 1.7257 0.9027 -0.0758
dipole: 1.9490
quadrupole: -115.3459 -111.9320 -129.0127
quadrupole: -1.8125 -1.8111 0.7777
quadrupole: 3.4176 6.8315 -10.2492 -1.8125 -1.8111 0.7777
hfenergy: -846.7634108 hartree
pointgroup: C01 [X(C22H16)]
dipole: 0.5984893 0.4793327 -0.0021403 debye
polarizability: 369.2914193|29.6793918|285.4368368|-11.9453322|15.0369419|137.5878442 unknown
InChI: InChI=1S/C22H16/c1-3-10-18(11-4-1)22(19-12-5-2-6-13-19)21-16-15-17-9-7-8-14-20(17)21/h1-16H
charge 0 multiplicity 1
38 atoms
C  -0.39023 -0.995927 0.111061
C  -1.875111 -0.886793 -0.030389
C  0.58424 0.00099 0.061488
C  -2.416145 -2.214887 0.109098
C  -0.116247 -2.434378 0.328663
C  2.023739 -0.338023 -0.138475
C  0.263038 1.448947 0.231205
C  -1.302316 -3.140931 0.359273
C  -2.737998 0.180124 -0.360171
C  -3.797829 -2.458061 -0.029404
C  -4.126696 -0.069351 -0.506113
C  3.041798 0.361735 0.571967
C  0.825095 2.428589 -0.634961
C  2.42198 -1.337596 -1.073592
C  -0.560788 1.887947 1.305594
C  -4.655402 -1.371809 -0.332234
C  4.403682 0.050205 0.380326
C  0.543865 3.799745 -0.4543
C  3.785123 -1.640207 -1.273493
C  -0.828969 3.259564 1.496311
C  4.782832 -0.953124 -0.542854
C  -0.283507 4.221708 0.613023
H  0.878846 -2.837446 0.51957
H  -1.413112 -4.21011 0.554214
H  -2.355923 1.195147 -0.498506
H  -4.200687 -3.471497 0.079807
H  -4.799049 0.759324 -0.75516
H  2.756195 1.140557 1.287515
H  1.47237 2.106671 -1.458267
H  1.654106 -1.849932 -1.662685
H  -0.978386 1.144367 1.992738
H  -5.732755 -1.539581 -0.444086
H  5.169576 0.589302 0.949063
H  0.971827 4.53796 -1.141689
H  4.069605 -2.403553 -2.00633
H  -1.45884 3.578265 2.334304
H  5.841577 -1.189204 -0.697592
H  -0.494505 5.286963 0.759384
