program: Gaussian 09
title: 000228852
version: EM64L-G09RevD.01
frameworkgroup: C1[X(C12H22O3)]
method: RPBEPBE
basis: SDD
operation: Freq
keyword: #pfreq=noraman
keyword: PBEPBE/SDD
title: #p freq=noraman PBEPBE/SDD
converged: YES YES NO NO
title: Mulliken charges:
elementType: O O O C C C C C C C C C C C C H H H H H H H H H H H H H H H H H H H H H H
charge: -0.295648 -0.271381 -0.207704 0.253010 0.287436 -0.521332 -0.748479 -0.730327 0.121864 -0.372886 -0.346146 -0.360503 -0.260351 -0.694773 -0.665750 0.233566 0.221513 0.230010 0.235418 0.215981 0.216825 0.222787 0.244781 0.216479 0.205416 0.192043 0.190978 0.196926 0.195613 0.237115 0.222642 0.211203 0.216362 0.210945 0.223191 0.251991 0.221188
chargesum: 0.00000
title: Mulliken charges with hydrogens summed into heavy atoms:
elementType: O O O C C C C C C C C C C C C
charge: -0.295648 -0.271381 -0.207704 0.253010 0.287436 -0.066254 -0.067071 -0.045934 0.121864 0.049009 0.036875 0.032036 0.199406 -0.056264 0.030619
polarizability: 1.46436875e+02 3.47335982e+00 1.46025793e+02 1.20925077e+00 1.85961613e+00 1.22803316e+02
1716.lowfreq: -6.3343 -4.6782 -0.0005 0.0004 0.0006 8.0647 17.8948 29.7195 53.5496
frequency: 17.7460 29.6308 53.5173 54.5817 67.0821 77.8517 98.3914 111.5744 129.0854 131.7230 155.6746 159.3346 189.6779 210.9488 232.2763 256.5922 284.7049 307.6487 319.7189 330.4090 351.0262 367.5886 420.7547 443.8035 469.5647 516.2620 576.4317 661.6348 706.5620 723.6433 730.3036 748.7537 795.6045 813.8415 831.0243 867.2773 893.2304 898.2428 938.2367 958.7517 981.9903 999.1251 1009.7276 1022.4989 1051.6024 1077.8104 1087.7055 1096.9060 1108.3436 1116.7570 1141.7790 1152.8692 1182.8956 1212.1908 1242.4574 1250.7931 1268.3175 1276.9122 1286.5364 1289.0846 1299.4597 1342.2878 1350.6747 1355.5773 1385.1553 1389.8292 1390.0506 1394.8803 1397.6943 1448.3717 1455.4322 1459.4838 1463.0743 1465.5306 1469.1088 1475.0812 1476.1056 1477.3462 1482.0328 1485.2060 1487.7463 1493.2835 1641.5647 2953.6954 2966.1292 2972.6541 2978.9950 2985.9107 2989.6745 2991.0133 2992.2010 2993.6225 3018.7554 3028.9135 3036.3047 3059.6778 3069.2730 3071.7878 3072.0187 3080.2441 3086.7103 3092.7791 3099.4277 3108.5821 3118.7669
redmass: 3.9472 3.4167 2.5388 1.9596 3.6282 3.3141 2.6016 2.4701 1.1477 1.8836 2.0763 3.1377 1.3278 1.3664 1.1188 2.7151 2.5679 2.6296 3.7641 4.1922 3.1453 2.8483 3.2210 3.2120 3.9775 4.6433 3.5471 5.5301 3.3717 1.0953 4.8733 1.2457 1.6129 1.9655 1.7254 2.5906 1.9473 2.8612 1.4054 1.3251 1.4026 2.0135 3.4793 2.4121 2.7689 2.3735 2.3706 2.2375 2.1018 2.0502 2.3906 1.6693 2.3396 1.9852 1.3732 1.7183 2.0799 1.1183 1.0675 1.1580 1.3668 1.4757 1.2904 1.6255 1.3132 1.2217 1.2307 2.7632 1.2347 1.0543 1.0925 1.0553 1.0440 1.0711 1.0679 1.0652 1.1818 1.0427 1.0642 1.0547 1.0766 1.0917 10.6332 1.0588 1.0594 1.0362 1.0621 1.0367 1.0388 1.0615 1.0360 1.0951 1.1008 1.0596 1.1006 1.1016 1.1007 1.0986 1.0993 1.0988 1.0976 1.1029 1.0994 1.0981 1.1062
irintensity: 0.7412 0.1253 1.2993 0.5196 0.3415 0.0557 0.3134 0.2786 0.0798 0.0951 0.6959 1.6735 0.6233 1.5694 0.0099 0.9292 1.9623 4.7555 0.9611 3.1417 4.2580 3.7902 0.8425 5.3471 11.3704 12.1562 3.8080 10.0028 9.6003 13.5033 6.0736 1.7246 2.6256 2.2784 1.3381 7.1147 14.9951 5.1133 0.9271 0.5437 1.7299 1.1768 2.1492 113.3432 2.0746 0.8148 185.4692 17.3867 8.0894 33.6822 29.7271 16.0764 17.8518 16.2457 4.6084 9.3156 21.6082 1.7766 1.4374 3.5560 1.7977 2.2283 0.5990 0.2233 27.0414 16.6058 21.1035 12.5635 15.7767 1.8675 11.8303 1.1664 14.2369 1.2892 8.7194 5.6519 4.8051 12.2837 11.7799 14.4730 1.0600 41.4520 158.6838 8.8653 43.8647 39.8265 14.8878 11.7417 40.8885 29.6206 16.2812 4.9783 9.9448 28.6618 15.9403 43.3950 103.6953 9.3694 47.8601 37.2719 37.7548 1.5213 22.5575 25.1245 28.7314
temp: 298.150 k
press: 1.00000 atm
elementType: 8 8 8 6 6 6 6 6 6 6 6 6 6 6 6 1 1 1 1 1 1 1 1 1 1 1 1 1 1 1 1 1 1 1 1 1 1
symmnumber: 1
zpe: 835227.4 jmol-1
zpe.correction: 0.318121 hartree
zpe.thermalcorrener: 0.337297 hartree
zpe.thermalcorrenthalpy: 0.338241 hartree
zpe.thermalcorrgfe: 0.268754 hartree
zpe.sumelectzpe: -694.894993 hartree
zpe.sumelectthermal: -694.875817 hartree
zpe.sumelectthermalent: -694.874873 hartree
zpe.sumelectthermalfe: -694.944361 hartree
dipole: 2.0487 1.0328 -3.7498
dipole: 4.3960
quadrupole: -96.3980 -84.0497 -98.5797
quadrupole: -2.7742 11.0101 1.0321
quadrupole: -3.3889 8.9595 -5.5706 -2.7742 11.0101 1.0321
hfenergy: -695.2131142 hartree
pointgroup: C01 [X(C12H22O3)]
dipole: -0.6214671 -0.6262143 -1.4875879 debye
polarizability: 145.2745536|3.5085393|146.9046309|0.4761306|-3.226033|123.0867992 unknown
InChI: InChI=1S/C12H22O3/c1-5-7-8-9-12(10(13)14-6-2)11(3,4)15-12/h5-9H2,1-4H3
charge 0 multiplicity 1
37 atoms
O  1.457114 2.105856 1.078144
O  1.525915 -1.118492 -0.58401
O  2.181603 -0.774372 1.631824
C  0.78232 0.903488 0.468829
C  1.292431 1.998986 -0.4423
C  -0.696925 0.728236 0.826659
C  0.346817 3.018881 -1.057322
C  2.607083 1.816375 -1.186752
C  1.585836 -0.382255 0.606655
C  -1.53531 0.012692 -0.259438
C  -3.009467 -0.170747 0.16525
C  -3.863855 -0.88174 -0.908765
C  2.196726 -2.459148 -0.570725
C  -5.335637 -1.06795 -0.480836
C  1.256985 -3.531379 -0.012526
H  -0.76167 0.169515 1.781656
H  -1.116347 1.730795 1.029054
H  0.833645 4.011074 -1.074951
H  -0.594735 3.114228 -0.494664
H  0.107841 2.740125 -2.100495
H  3.079635 2.799005 -1.36678
H  2.435072 1.326159 -2.162272
H  3.313202 1.199407 -0.606989
H  -1.090125 -0.974515 -0.488381
H  -1.492214 0.596037 -1.201214
H  -3.051064 -0.752834 1.109751
H  -3.457277 0.819646 0.391858
H  -3.822147 -0.299344 -1.851882
H  -3.414792 -1.870535 -1.134794
H  3.119638 -2.382467 0.030638
H  2.443429 -2.633154 -1.630156
H  -5.406419 -1.674537 0.441749
H  -5.924898 -1.576825 -1.265687
H  -5.815618 -0.092133 -0.276988
H  0.311411 -3.562734 -0.581345
H  1.032014 -3.340485 1.050055
H  1.737981 -4.524258 -0.088747
