program: Gaussian 09
title: 000228850
version: EM64L-G09RevD.01
frameworkgroup: C1[X(C12H20O3)]
method: RPBEPBE
basis: SDD
operation: Freq
keyword: #pfreq=noraman
keyword: PBEPBE/SDD
title: #p freq=noraman PBEPBE/SDD
converged: YES YES NO NO
title: Mulliken charges:
elementType: O O O C C C C C C C C C C C C H H H H H H H H H H H H H H H H H H H H
charge: -0.302723 -0.272130 -0.208100 0.367029 0.215203 -0.512508 -0.498252 -0.470596 -0.410133 -0.412980 -0.392784 0.138396 -0.695556 -0.261481 -0.664005 0.200951 0.216822 0.222906 0.208642 0.232106 0.224697 0.201643 0.219593 0.221957 0.201334 0.208054 0.188644 0.236399 0.226216 0.216307 0.221946 0.235808 0.219147 0.252254 0.225196
chargesum: 0.00000
title: Mulliken charges with hydrogens summed into heavy atoms:
elementType: O O O C C C C C C C C C C C C
charge: -0.302723 -0.272130 -0.208100 0.367029 0.215203 -0.094735 -0.066703 -0.013792 0.011102 0.010311 0.003913 0.138396 -0.016635 0.196272 0.032592
polarizability: 1.53266162e+02 6.72130499e-01 1.33479089e+02 8.04938122e-01 1.26899411e+00 1.16220939e+02
1716.lowfreq: -18.6830 -13.8313 -0.0001 0.0006 0.0008 5.8218 18.6323 46.4325 63.7621
frequency: 16.9716 46.3718 63.7340 66.2877 86.3154 95.0887 142.2013 144.5828 184.2522 192.3890 212.9410 264.7801 277.5435 285.7144 302.8407 337.7644 369.3896 404.4576 406.7399 425.5967 475.8601 488.6507 496.4395 636.0327 673.6223 710.3350 726.4554 766.0866 774.2945 808.9051 812.7601 824.5861 844.4385 868.1496 901.7552 905.7628 919.7773 947.2769 983.7705 1009.0372 1038.6827 1060.1643 1074.3717 1079.8160 1087.1546 1095.3288 1097.7062 1123.7746 1140.7617 1154.1320 1194.4741 1225.2997 1237.7415 1247.3186 1267.4804 1277.1893 1277.5683 1316.1667 1323.1906 1326.2715 1338.2978 1342.4036 1346.2943 1353.1311 1391.5326 1395.2922 1417.2788 1442.4007 1452.5001 1456.5359 1463.6154 1463.9103 1466.2351 1474.1016 1476.2219 1479.8211 1485.2525 1490.6095 1640.8466 2964.2249 2971.5419 2980.2983 2984.9252 2985.8545 2989.5397 2993.0967 2999.2479 3027.4618 3031.9858 3041.5085 3048.3234 3053.0004 3055.8611 3066.2706 3082.9776 3087.4047 3092.8195 3094.4181 3118.6592
redmass: 4.1527 3.3490 2.6140 3.3129 3.5657 2.7600 3.9394 2.9162 1.3227 1.9943 1.2855 2.3735 2.0648 2.8043 2.6679 3.9291 2.6912 3.0252 2.7008 3.2048 3.9898 2.0976 3.9657 4.1489 3.7021 6.1430 2.8577 1.5894 1.4962 1.6883 2.0297 2.5249 1.6333 2.2777 3.1123 2.8925 1.4019 2.3062 2.6348 2.6765 2.0391 2.3723 1.7283 1.8794 1.7570 1.8341 1.8093 2.1872 1.6379 1.6587 2.6514 1.4267 1.5790 1.4293 1.3282 1.4212 1.1238 1.4459 1.4745 1.4730 1.4333 1.5608 1.5729 1.2843 1.2319 1.2219 2.8640 1.0906 1.1430 1.0942 1.0806 1.0509 1.0840 1.0405 1.0955 1.0533 1.0516 1.0777 10.5703 1.0637 1.0657 1.0627 1.0628 1.0605 1.0357 1.0361 1.0627 1.0595 1.0958 1.1006 1.1007 1.0998 1.1010 1.0960 1.1001 1.0975 1.1032 1.0999 1.1058
irintensity: 0.3561 0.8562 0.1410 0.5713 0.3608 0.1255 3.0226 0.6213 0.2760 1.1098 1.2142 0.8864 0.9243 3.1344 4.6258 6.0378 0.1673 3.1620 4.4561 0.3904 4.1942 3.7469 11.5107 9.2930 1.7450 7.9221 12.4640 8.0454 0.2714 9.0218 2.6068 2.0117 7.4321 10.1339 30.6847 6.8358 5.0883 17.8927 11.6795 52.2253 2.3421 9.5979 114.3809 71.3690 44.9529 3.5482 9.9051 2.6134 10.2024 17.5338 41.1882 2.4164 9.5146 6.9326 11.8401 3.1010 2.7521 1.6633 3.3491 1.8818 0.1621 0.2810 0.7517 0.1183 24.9981 18.2138 6.2240 7.7396 9.6766 13.9562 9.0202 18.9559 10.6760 6.7571 7.1824 4.8025 15.6176 21.1667 157.6805 38.0862 12.8468 32.6262 19.5859 43.5123 30.9923 17.1873 15.7532 32.7470 69.3538 50.8543 21.5769 2.5597 51.4152 35.7918 43.6652 39.0609 0.5870 38.3484 29.4029
temp: 298.150 k
press: 1.00000 atm
elementType: 8 8 8 6 6 6 6 6 6 6 6 6 6 6 6 1 1 1 1 1 1 1 1 1 1 1 1 1 1 1 1 1 1 1 1
symmnumber: 1
zpe: 787084.5 jmol-1
zpe.correction: 0.299785 hartree
zpe.thermalcorrener: 0.316354 hartree
zpe.thermalcorrenthalpy: 0.317298 hartree
zpe.thermalcorrgfe: 0.254605 hartree
zpe.sumelectzpe: -693.723555 hartree
zpe.sumelectthermal: -693.706986 hartree
zpe.sumelectthermalent: -693.706041 hartree
zpe.sumelectthermalfe: -693.768734 hartree
dipole: 0.1689 -0.4350 -4.0298
dipole: 4.0568
quadrupole: -82.6041 -84.7372 -100.7526
quadrupole: -2.0550 -3.9599 -0.0615
quadrupole: 6.7605 4.6274 -11.3880 -2.0550 -3.9599 -0.0615
hfenergy: -694.0233397 hartree
pointgroup: C01 [X(C12H20O3)]
dipole: 0.1016668 0.2294998 1.5761982 debye
polarizability: 153.2222991|-0.3463025|133.5300033|-1.711149|0.6371797|116.2138874 unknown
InChI: InChI=1S/C12H20O3/c1-3-12(10(13)14-4-2)11(15-12)8-6-5-7-9-11/h3-9H2,1-2H3
charge 0 multiplicity 1
35 atoms
O  -0.769357 -0.563052 -1.428584
O  2.075317 0.240338 0.687531
O  2.189887 0.01285 -1.6350
C  -0.968422 -0.135656 0.034788
C  0.261965 -0.904354 -0.382995
C  -2.133177 -0.814274 0.749351
C  -0.916563 1.376979 0.233541
C  0.449476 -2.401988 -0.111522
C  -3.478879 -0.156558 0.350907
C  -2.267403 2.027665 -0.157177
C  -3.451806 1.371438 0.590859
C  1.580198 -0.164258 -0.559457
C  0.898685 -2.724524 1.332039
C  3.404735 0.934088 0.679275
C  3.235848 2.429114 0.396641
H  -1.980317 -0.707591 1.843412
H  -2.158338 -1.893691 0.522036
H  -0.099264 1.811769 -0.369538
H  -0.686549 1.584704 1.298358
H  1.186299 -2.795157 -0.838401
H  -0.506649 -2.9059 -0.338826
H  -4.304237 -0.623139 0.921843
H  -3.668654 -0.35698 -0.721993
H  -2.413282 1.911985 -1.249193
H  -2.231662 3.113556 0.053738
H  -4.406788 1.824862 0.262929
H  -3.357935 1.571751 1.678913
H  1.850463 -2.224447 1.580561
H  0.1445 -2.389962 2.066827
H  1.037644 -3.813539 1.456241
H  3.799769 0.743809 1.690012
H  4.045733 0.452948 -0.080549
H  4.215131 2.93602 0.481337
H  2.8517 2.592907 -0.623967
H  2.544133 2.892586 1.121259
