program: Gaussian 09
title: 000228863
version: EM64L-G09RevD.01
frameworkgroup: C1[X(C21H28O2)]
method: RPBEPBE
basis: SDD
operation: Freq
keyword: #pfreq=noraman
keyword: PBEPBE/SDD
title: #p freq=noraman PBEPBE/SDD
converged: YES YES NO NO
title: Mulliken charges:
elementType: O O C C C C C C C C C C C C C C C C C C C C C H H H H H H H H H H H H H H H H H H H H H H H H H H H H
charge: -0.212899 -0.234403 -0.128913 -0.135492 0.268179 -0.177269 0.217201 -0.233292 -0.557719 -0.491990 -0.469267 -0.299670 -0.240337 0.533442 -0.640471 -0.789361 -0.484477 -0.793081 0.156478 -0.562607 -0.585169 0.181952 -0.792565 0.227426 0.226590 0.214201 0.245902 0.206851 0.236909 0.226550 0.221467 0.262112 0.212420 0.220648 0.215470 0.223069 0.239381 0.252712 0.228204 0.223325 0.221065 0.207077 0.217021 0.241310 0.230354 0.246703 0.230893 0.256450 0.243806 0.238654 0.255157
chargesum: 0.00000
title: Mulliken charges with hydrogens summed into heavy atoms:
elementType: O O C C C C C C C C C C C C C C C C C C C C C
charge: -0.212899 -0.234403 0.098513 0.091098 0.268179 0.036932 0.217201 0.012611 -0.113960 -0.043973 0.005265 -0.079022 -0.024866 0.533442 -0.178020 -0.085120 -0.056335 -0.104396 0.156478 -0.085011 -0.328718 0.181952 -0.054947
polarizability: 3.10430046e+02 -4.12929633e+00 2.04027563e+02 -1.48566080e+01 2.70518124e+00 1.64114568e+02
1716.lowfreq: 0.0003 0.0003 0.0007 4.8743 8.8834 18.7714 33.9336 45.5059 62.9915
frequency: 33.6762 45.4878 62.9279 72.9055 90.2544 104.8842 116.3637 158.3312 167.7326 174.0330 193.9973 207.8025 217.3792 238.0377 239.0689 257.6053 259.9349 272.3936 285.0488 306.0776 323.2792 345.4005 365.9150 389.3494 409.6558 426.1836 443.5669 446.5451 496.2340 510.4905 519.4652 528.1886 551.3449 572.5844 581.9444 586.9618 624.0667 646.5733 675.8887 679.3227 722.2555 759.7362 765.5899 778.5802 812.7556 832.1702 841.8221 852.5024 883.1647 906.0166 916.2917 925.6609 932.2687 945.3444 951.3749 966.1587 969.4061 977.3464 983.3403 991.3401 1015.2272 1024.6785 1035.0495 1037.8933 1043.4557 1058.1851 1080.2216 1087.4637 1112.2094 1120.7925 1124.6327 1129.8530 1154.0650 1160.2654 1171.5988 1183.1907 1189.4399 1193.6688 1200.3906 1210.9313 1217.8442 1233.0567 1237.2536 1255.4694 1257.3632 1272.1233 1278.8601 1284.8469 1287.4169 1297.1397 1316.5270 1319.3536 1329.9724 1334.3383 1337.4717 1345.1908 1350.2435 1352.9286 1363.9936 1382.9376 1383.4981 1392.8269 1403.3695 1442.3831 1445.6268 1451.1423 1454.3959 1463.0419 1465.0574 1469.9284 1476.0939 1478.0533 1482.4846 1490.8820 1493.4254 1585.1426 1621.5225 1624.1406 1642.7643 2890.9409 2922.2983 2951.8583 2969.8751 2975.2461 2977.8758 2981.2679 2982.4390 2984.7997 2989.7379 2990.9586 2997.7349 3015.0679 3038.6276 3041.3126 3043.4767 3053.6302 3062.3662 3063.7609 3075.6538 3076.8153 3080.2290 3081.9849 3082.4445 3096.4157 3118.0734 3118.7768 3119.8522
redmass: 6.5467 3.8488 4.1598 4.2309 2.9726 1.1558 3.1830 4.0610 2.7858 3.0038 2.5087 2.7708 1.6745 1.9760 1.8973 1.7387 1.7546 2.7678 2.4229 3.1962 2.7581 3.8030 2.9281 2.8522 3.2956 3.7358 3.5224 3.0953 3.6294 3.4946 3.1475 2.5373 2.8705 3.1168 2.8414 3.5477 3.6970 3.7935 2.3797 3.0533 2.0843 2.1029 3.2922 2.2674 1.9862 2.0811 2.3447 2.1214 1.4625 2.0134 3.2506 1.7986 2.1039 1.6939 1.8563 1.9757 1.5286 2.1002 1.9826 2.1265 2.1772 2.0686 2.0622 1.9977 2.0283 2.4027 2.4988 2.0291 1.9480 2.2186 2.1810 1.8549 1.7059 1.6984 2.0139 2.2542 1.8804 2.1504 1.5333 1.2956 1.4103 1.4694 1.4059 1.4624 1.4758 1.4146 1.8881 1.4325 1.4613 1.3830 1.4399 1.4715 1.5971 1.4829 1.5667 1.8111 1.4756 1.4180 1.2552 1.3728 1.4357 1.2301 1.2456 1.0729 1.0793 1.0565 1.0867 1.0640 1.0825 1.0897 1.0602 1.0737 1.0607 1.0543 1.0813 10.0393 7.2790 7.7395 7.9435 1.0800 1.0813 1.0662 1.0646 1.0633 1.0392 1.0623 1.0572 1.0526 1.0625 1.0594 1.0607 1.0635 1.0945 1.0992 1.1002 1.1014 1.0937 1.0956 1.0983 1.0993 1.1033 1.0905 1.0924 1.0998 1.0956 1.0912 1.1005
irintensity: 3.9896 3.9415 1.1518 2.8610 0.3635 0.5426 2.4316 1.1949 0.0505 0.1074 1.7906 0.5343 0.0946 0.9729 1.8380 0.6146 3.0920 1.0477 0.3615 3.7732 1.6974 0.4605 3.2471 0.1041 0.1815 0.8933 5.6001 1.1749 3.4760 2.3453 1.4340 0.2717 6.7079 3.9591 0.4755 5.5165 1.4535 0.6554 14.4550 2.3335 13.8057 14.5803 1.4334 6.7748 4.8104 6.2656 4.9726 3.9964 18.4000 12.1833 4.5755 3.0068 3.0690 6.2922 18.1930 1.9318 2.7639 3.9604 4.6002 0.2506 1.6019 8.6193 3.6390 1.6400 4.9741 1.7115 7.8530 1.7718 21.1847 4.8024 2.3464 9.1004 8.2649 5.4359 15.7885 43.4918 29.4740 1.1208 49.4364 8.7869 22.6367 10.6818 27.8815 5.7138 3.7579 8.6296 28.7565 12.1840 2.1478 3.6320 0.8338 7.9007 7.5141 10.3223 30.5991 4.7555 4.2387 1.2721 68.5988 9.7205 4.1376 22.6784 15.0890 17.3461 16.2648 13.3228 17.6624 15.0023 9.0679 6.8119 8.8028 3.3296 3.1484 10.0580 10.0790 165.8958 124.2146 187.9854 3.5048 15.9035 14.7097 14.4020 16.8304 22.1330 1.6598 19.3143 3.0368 31.1089 49.4940 8.4805 39.5616 33.4010 44.6238 18.3126 45.9091 23.3203 9.9791 21.7528 17.7475 31.4543 35.7123 19.3817 22.4800 24.3063 46.2594 8.7502 13.9048
temp: 298.150 k
press: 1.00000 atm
elementType: 8 8 6 6 6 6 6 6 6 6 6 6 6 6 6 6 6 6 6 6 6 6 6 1 1 1 1 1 1 1 1 1 1 1 1 1 1 1 1 1 1 1 1 1 1 1 1 1 1 1 1
symmnumber: 1
zpe: 1153061.8 jmol-1
zpe.correction: 0.439178 hartree
zpe.thermalcorrener: 0.460894 hartree
zpe.thermalcorrenthalpy: 0.461839 hartree
zpe.thermalcorrgfe: 0.390009 hartree
zpe.sumelectzpe: -965.718029 hartree
zpe.sumelectthermal: -965.696312 hartree
zpe.sumelectthermalent: -965.695368 hartree
zpe.sumelectthermalfe: -965.767198 hartree
dipole: -2.7129 -0.4984 -0.3175
dipole: 2.7765
quadrupole: -199.4820 -128.7357 -138.2995
quadrupole: 5.1173 19.6733 0.7261
quadrupole: -43.9763 26.7700 17.2063 5.1173 19.6733 0.7261
hfenergy: -966.157207 hartree
pointgroup: C01 [X(C21H28O2)]
dipole: 1.0673783 0.1924391 -0.1301689 debye
polarizability: 310.4595698|-3.9422707|203.910647|14.7488241|-3.5148419|164.2019604 unknown
InChI: InChI=1S/C21H28O2/c1-13(22)17-6-7-18-16-5-4-14-12-15(23)8-10-20(14,2)19(16)9-11-21(17,18)3/h9,11-12,16-19H,4-8,10H2,1-3H3
charge 0 multiplicity 1
51 atoms
O  5.62814 0.243984 0.665626
O  -6.25633 0.300801 -0.822939
C  1.446327 -0.990842 -0.39954
C  0.030222 -1.002698 0.204018
C  2.299717 0.202275 0.145845
C  -0.706459 0.275209 -0.304582
C  -2.126384 0.480678 0.365659
C  3.621943 -0.043536 -0.702756
C  2.393478 -2.202948 -0.274325
C  -0.809844 -2.247162 -0.143695
C  3.790625 -1.602779 -0.659517
C  1.536243 1.492168 -0.093626
C  0.18389 1.513862 -0.250439
C  -2.922752 -0.827621 0.186957
C  -2.214363 -2.135082 0.505127
C  2.626903 0.099686 1.666506
C  -2.861702 1.65364 -0.356596
C  -1.984536 0.803022 1.885006
C  4.850324 0.722487 -0.205766
C  -4.380769 1.697512 -0.089953
C  -4.234308 -0.843188 -0.21693
C  -5.051571 0.367981 -0.428244
C  5.107711 2.094188 -0.819543
H  1.322781 -0.798511 -1.490189
H  0.116099 -0.957743 1.308996
H  -0.928725 0.090335 -1.383811
H  3.40353 0.294267 -1.73561
H  2.103005 -3.034273 -0.940566
H  2.402258 -2.598143 0.758669
H  -0.311384 -3.166044 0.218395
H  -0.908835 -2.339879 -1.244683
H  4.56776 -1.866097 0.078458
H  4.130393 -1.973716 -1.642908
H  2.086795 2.443252 -0.061308
H  -0.307675 2.485215 -0.395174
H  -2.084251 -2.207629 1.606628
H  -2.85332 -2.986628 0.20877
H  3.292382 -0.750028 1.894744
H  3.144092 1.014064 2.009489
H  1.703529 0.004734 2.263415
H  -2.698132 1.553109 -1.448884
H  -2.415275 2.617735 -0.049858
H  -1.549916 -0.037853 2.453077
H  -1.325918 1.679579 2.025718
H  -2.9676 1.031016 2.333498
H  -4.870368 2.499458 -0.670136
H  -4.583598 1.913523 0.97907
H  -4.757484 -1.797034 -0.365637
H  5.486922 1.96439 -1.852823
H  4.177571 2.685781 -0.897609
H  5.861758 2.64309 -0.234024
