program: Gaussian 09
title: 000228847
version: EM64L-G09RevD.01
frameworkgroup: C1[X(C11H20O3)]
method: RPBEPBE
basis: SDD
operation: Freq
keyword: #pfreq=noraman
keyword: PBEPBE/SDD
title: #p freq=noraman PBEPBE/SDD
converged: YES YES NO NO
title: Mulliken charges:
elementType: O O O C C C C C C C C C C C H H H H H H H H H H H H H H H H H H H H
charge: -0.295677 -0.272562 -0.207120 0.255688 0.288060 -0.511619 -0.731866 -0.748930 0.122127 -0.358337 -0.347283 -0.698642 -0.260664 -0.665635 0.221106 0.228333 0.245763 0.223175 0.217263 0.230541 0.216027 0.235615 0.203861 0.217902 0.197503 0.198997 0.210368 0.211265 0.218424 0.222455 0.236569 0.221021 0.253261 0.223010
chargesum: 0.00000
title: Mulliken charges with hydrogens summed into heavy atoms:
elementType: O O O C C C C C C C C C C C
charge: -0.295677 -0.272562 -0.207120 0.255688 0.288060 -0.062180 -0.045665 -0.066747 0.122127 0.063426 0.049217 -0.058585 0.198360 0.031657
polarizability: 1.29637946e+02 2.17673053e+00 1.38256819e+02 3.63438238e-01 1.93837630e+00 1.13974828e+02
1716.lowfreq: -7.3904 -0.0006 -0.0002 0.0004 7.1022 8.3140 15.6818 41.5241 60.7192
frequency: 12.0999 41.5128 60.7006 69.0957 76.7708 90.0687 107.2559 133.8994 148.6191 167.7075 192.9630 200.7233 227.4360 229.5463 275.2932 284.0409 307.8139 328.6472 355.7131 369.0797 386.9595 441.6771 463.4130 518.2870 578.0412 662.7145 706.0778 728.1679 731.5064 773.3944 809.2213 814.1991 853.3187 882.1940 909.9311 935.1584 942.1249 978.5950 997.8886 1017.2542 1028.4781 1072.5086 1086.4840 1096.6935 1103.9922 1117.1071 1141.9050 1152.8055 1185.2497 1220.2800 1254.0732 1259.1206 1277.4061 1279.7922 1290.3335 1325.5897 1351.0733 1354.2901 1387.9010 1389.8914 1390.3343 1394.7957 1399.6930 1448.9167 1455.3337 1461.3630 1462.9918 1469.0244 1473.5590 1476.4190 1476.9993 1481.1772 1484.4519 1488.7866 1493.8596 1641.3121 2965.1386 2972.6946 2979.4912 2986.5218 2990.2979 2990.7988 2992.1314 3007.6350 3028.2544 3034.9837 3058.2553 3069.9944 3072.3706 3073.0484 3080.6396 3086.6262 3093.1468 3098.7717 3111.8769 3118.8701
redmass: 4.0086 3.4669 3.0374 1.7536 3.0480 3.3656 2.7575 2.4540 1.3111 1.8395 1.8815 1.2927 1.5034 1.1035 3.0077 2.4564 2.6809 5.1689 3.5752 2.7805 2.9122 3.3711 4.0816 4.3609 3.5607 5.5302 3.4694 1.1625 4.7372 1.3883 1.3161 2.9044 3.0828 2.3011 2.2829 1.4102 1.3925 1.5414 1.8894 3.1510 2.4102 2.4731 2.3932 2.2253 2.1649 1.9634 2.3835 1.6702 2.5170 1.9219 1.4017 2.4856 1.1177 1.3540 1.0695 1.4207 1.3231 1.5292 1.4193 1.2299 1.2190 2.4180 1.2369 1.0531 1.0936 1.0565 1.0430 1.0719 1.0617 1.1535 1.0538 1.0609 1.0551 1.0740 1.0925 10.6530 1.0586 1.0372 1.0621 1.0367 1.0410 1.0577 1.0360 1.0980 1.0598 1.0989 1.1011 1.1008 1.0987 1.0992 1.0988 1.0976 1.1029 1.0996 1.0977 1.1060
irintensity: 0.6458 0.1564 1.6580 0.0928 0.4376 0.1093 0.4379 0.1271 0.2953 1.4919 1.7278 0.8823 0.3101 0.0563 1.0162 1.5432 4.7417 3.5116 5.4142 2.9924 1.0893 4.1782 11.2809 11.1257 4.6074 10.4512 9.4887 13.0658 6.2856 2.0550 0.9133 2.1750 3.7212 10.1950 6.8589 6.3245 0.8923 5.5251 2.3359 62.4750 58.5993 7.6424 180.0149 10.2147 16.8118 25.1852 25.4158 16.9281 27.5032 13.7014 5.0850 21.1271 2.2181 9.0507 0.9409 1.3925 0.2978 3.4525 23.2526 25.0574 12.6484 16.3340 17.6650 1.8113 11.1803 1.3577 14.9266 1.3566 15.2250 2.7303 17.0293 2.1369 11.9122 8.6392 37.3877 158.1785 26.8325 28.7929 9.3925 12.2264 48.5542 27.3091 16.3614 5.6264 28.5816 2.5085 15.8717 107.6669 10.6465 50.4893 35.7533 36.1335 1.2841 22.6287 24.4277 28.9597
temp: 298.150 k
press: 1.00000 atm
elementType: 8 8 8 6 6 6 6 6 6 6 6 6 6 6 1 1 1 1 1 1 1 1 1 1 1 1 1 1 1 1 1 1 1 1
symmnumber: 1
zpe: 762587.4 jmol-1
zpe.correction: 0.290454 hartree
zpe.thermalcorrener: 0.308119 hartree
zpe.thermalcorrenthalpy: 0.309064 hartree
zpe.thermalcorrgfe: 0.243456 hartree
zpe.sumelectzpe: -655.671772 hartree
zpe.sumelectthermal: -655.654107 hartree
zpe.sumelectthermalent: -655.653163 hartree
zpe.sumelectthermalfe: -655.718770 hartree
dipole: 1.9702 1.1704 -3.6664
dipole: 4.3236
quadrupole: -87.7463 -77.9697 -91.9319
quadrupole: -3.1673 9.8809 1.8537
quadrupole: -1.8637 7.9130 -6.0493 -3.1673 9.8809 1.8537
hfenergy: -655.9622265 hartree
pointgroup: C01 [X(C11H20O3)]
dipole: -0.3888897 -0.7176248 -1.4924222 debye
polarizability: 128.8798372|-0.6454219|138.5917589|2.2639095|-2.5286426|114.3979971 unknown
InChI: InChI=1S/C11H20O3/c1-5-7-8-11(9(12)13-6-2)10(3,4)14-11/h5-8H2,1-4H3
charge 0 multiplicity 1
34 atoms
O  0.477329 2.18503 1.126116
O  1.401837 -0.892509 -0.57832
O  1.914404 -0.404532 1.648023
C  0.155346 0.871289 0.460914
C  0.413889 2.087954 -0.401302
C  -1.245806 0.31719 0.739614
C  1.763879 2.258146 -1.083431
C  -0.728101 2.859769 -1.043684
C  1.253848 -0.171438 0.614154
C  -1.841508 -0.530453 -0.409773
C  -3.225276 -1.114991 -0.045322
C  -3.845819 -1.938405 -1.193901
C  2.393644 -2.016769 -0.554285
C  1.763055 -3.290001 0.016455
H  -1.908852 1.173497 0.96179
H  -1.204147 -0.286507 1.668382
H  2.577229 1.830891 -0.473794
H  1.765071 1.756912 -2.068501
H  1.979088 3.331235 -1.235867
H  -0.510003 3.942638 -1.003086
H  -0.833573 2.574915 -2.106936
H  -1.690482 2.68999 -0.536568
H  -1.934646 0.094265 -1.320908
H  -1.148366 -1.35325 -0.669569
H  -3.912457 -0.289636 0.232752
H  -3.125074 -1.751867 0.857301
H  -3.191547 -2.785645 -1.473893
H  -3.989364 -1.314762 -2.09647
H  -4.830656 -2.351886 -0.909224
H  2.676275 -2.130844 -1.612876
H  3.266414 -1.699733 0.043426
H  2.482882 -4.126342 -0.056919
H  1.501686 -3.155139 1.079209
H  0.854902 -3.568013 -0.546306
