program: Gaussian 09
title: 000228846
version: EM64L-G09RevD.01
frameworkgroup: C1[X(C11H20O)]
method: RPBEPBE
basis: SDD
operation: Freq
keyword: #pfreq=noraman
keyword: PBEPBE/SDD
title: #p freq=noraman PBEPBE/SDD
converged: YES YES NO NO
title: Mulliken charges:
elementType: O C C C C C C C C C C C H H H H H H H H H H H H H H H H H H H H
charge: -0.204213 -0.119357 -0.438915 -0.441589 -0.391441 -0.398786 -0.385805 0.150463 -0.525091 -0.342812 -0.345696 -0.695100 0.206824 0.218913 0.200036 0.202566 0.227679 0.203473 0.190918 0.189587 0.202104 0.200319 0.194369 0.230112 0.231313 0.219141 0.201494 0.189443 0.190619 0.211549 0.214619 0.213267
chargesum: 0.00000
title: Mulliken charges with hydrogens summed into heavy atoms:
elementType: O C C C C C C C C C C C
charge: -0.204213 0.087466 -0.019966 -0.011344 0.002950 -0.007096 0.008883 0.150463 -0.063666 0.077823 0.034366 -0.055665
polarizability: 1.45924963e+02 -9.64225322e-01 1.07580712e+02 -7.20799250e-01 2.30304836e+00 1.00837717e+02
1716.lowfreq: -19.6977 -0.9993 -0.0002 0.0004 0.0007 10.2847 25.2101 39.6824 64.4944
frequency: 24.5329 39.3187 64.4248 69.4715 113.7441 129.7717 179.6031 220.0982 230.0927 232.9231 260.2817 304.5663 344.9824 399.2733 428.6522 468.7213 503.0461 548.8074 683.2567 721.6755 776.1451 787.1819 789.9667 834.2980 872.2491 883.8868 886.6593 902.9795 908.2424 928.0850 988.1488 1026.5806 1041.5295 1052.4404 1060.0493 1062.1583 1082.9208 1094.8644 1111.5783 1125.1857 1145.2284 1179.1865 1201.5078 1234.2474 1253.3090 1255.8262 1261.6733 1270.5709 1285.1221 1289.1977 1305.0951 1320.4715 1329.6684 1335.1852 1342.7408 1346.2002 1353.8852 1358.4180 1391.2564 1427.7209 1461.9122 1462.7205 1464.9362 1465.4923 1471.5859 1474.5589 1477.0225 1479.1166 1487.0580 1622.4636 2944.4739 2959.8400 2960.8400 2963.6827 2965.1382 2969.5696 2973.8772 2973.9429 2986.9333 2989.1370 2992.3843 3004.6668 3023.9924 3028.2264 3033.1177 3040.3006 3052.0158 3052.7153 3071.4924 3072.8803
redmass: 4.2139 1.5659 3.2077 3.4354 2.2435 2.8535 2.9191 2.0714 1.2046 2.3198 3.0325 4.0561 2.1538 2.5714 3.0202 2.8120 1.5757 2.2023 4.2893 1.1285 2.0010 1.5400 1.4437 2.6218 1.7092 2.9943 1.7161 1.6859 1.4356 1.6012 3.0122 3.0505 1.8761 1.5452 1.4231 1.4034 2.0157 1.4945 2.2894 2.4684 2.3319 1.5125 1.4949 1.3574 1.3162 1.3895 1.2726 1.1963 1.0883 1.2130 1.3020 1.3178 1.5564 1.3668 1.4918 1.5822 1.5507 1.7254 1.2176 1.0932 1.0865 1.0871 1.0864 1.0730 1.0832 1.0672 1.0422 1.0923 1.0770 8.1966 1.0628 1.0779 1.0618 1.0630 1.0613 1.0634 1.0611 1.0363 1.0619 1.0797 1.0763 1.0994 1.0984 1.0942 1.1031 1.1037 1.1021 1.1023 1.1007 1.0995
irintensity: 0.7579 0.0767 1.4911 1.3311 0.7302 2.2721 1.5373 0.1767 0.0643 0.0225 0.3230 7.5778 0.6260 1.9749 0.3389 0.5967 1.5769 0.1186 8.2166 10.6291 0.3004 0.1423 0.0279 4.4203 2.9434 6.6292 14.5818 4.8925 1.7902 2.4161 34.2158 1.7397 2.5910 0.6435 4.6570 2.3028 1.0078 1.2769 0.2836 19.2655 34.7344 2.2612 0.3573 5.4116 5.9093 22.5295 1.7425 0.4555 4.7530 15.6553 6.7712 0.1935 32.5828 0.3495 3.4286 7.6466 4.6661 16.5055 13.7276 20.8192 2.9087 7.1461 11.1524 2.6402 19.9639 3.9183 12.3848 3.9479 17.5155 88.6937 15.5962 5.1866 43.3763 33.9739 47.0090 31.5273 31.5103 33.8598 20.2888 26.6118 18.8794 9.9094 77.9014 58.9307 14.9606 38.5696 88.4228 21.7941 89.2859 53.5742
temp: 298.150 k
press: 1.00000 atm
elementType: 8 6 6 6 6 6 6 6 6 6 6 6 1 1 1 1 1 1 1 1 1 1 1 1 1 1 1 1 1 1 1 1
symmnumber: 1
zpe: 753617.4 jmol-1
zpe.correction: 0.287038 hartree
zpe.thermalcorrener: 0.300712 hartree
zpe.thermalcorrenthalpy: 0.301656 hartree
zpe.thermalcorrgfe: 0.245250 hartree
zpe.sumelectzpe: -505.420701 hartree
zpe.sumelectthermal: -505.407027 hartree
zpe.sumelectthermalent: -505.406083 hartree
zpe.sumelectthermalfe: -505.462489 hartree
dipole: -0.5949 2.0629 2.0173
dipole: 2.9459
quadrupole: -72.7180 -78.2584 -76.9917
quadrupole: 0.8828 1.7161 -3.7028
quadrupole: 3.2714 -2.2690 -1.0024 0.8828 1.7161 -3.7028
hfenergy: -505.7077391 hartree
pointgroup: C01 [X(C11H20O1)]
dipole: -0.2401668 0.8643692 0.7338422 debye
polarizability: 145.9373041|-0.7143852|107.8610379|-0.7028583|1.7944695|100.5450499 unknown
InChI: InChI=1S/C11H20O/c1-2-3-9-11(12)10-7-5-4-6-8-10/h10H,2-9H2,1H3
charge 0 multiplicity 1
32 atoms
O  0.50339 -1.467597 -0.96891
C  -1.026337 -0.089417 0.344803
C  -1.503073 1.033068 -0.635289
C  -2.058888 -1.243187 0.386002
C  -2.912288 1.54517 -0.256627
C  -3.471908 -0.73062 0.749796
C  -3.937659 0.388219 -0.212161
C  0.363637 -0.562499 -0.100898
C  1.565146 0.141448 0.534648
C  2.911763 -0.130645 -0.160313
C  4.098213 0.558594 0.54995
C  5.445274 0.303086 -0.160293
H  -0.937148 0.366087 1.354461
H  -1.523717 0.613654 -1.661046
H  -0.780377 1.87297 -0.639422
H  -1.73201 -2.011622 1.113324
H  -2.072158 -1.734388 -0.605709
H  -3.23464 2.316795 -0.982704
H  -2.870466 2.036774 0.73758
H  -3.46659 -0.337478 1.788156
H  -4.190089 -1.573172 0.732445
H  -4.930526 0.769568 0.095674
H  -4.055938 -0.032836 -1.231914
H  1.607509 -0.185458 1.597607
H  1.352146 1.230497 0.579951
H  3.080515 -1.223113 -0.208983
H  2.855213 0.211654 -1.212413
H  3.911887 1.651142 0.605954
H  4.158276 0.199638 1.598195
H  5.421576 0.681002 -1.199733
H  6.28145 0.802362 0.36286
H  5.670218 -0.779095 -0.203788
