program: Gaussian 09
title: 000228845
version: EM64L-G09RevD.01
frameworkgroup: C1[X(C11H13NO2)]
method: RPBEPBE
basis: SDD
operation: Freq
keyword: #p
keyword: freq=noraman
keyword: PBEPBE/SDD
title: #p freq=noraman PBEPBE/SDD
converged: YES YES NO NO
title: Mulliken charges:
elementType: O O N C C C C C C C C C C C H H H H H H H H H H H H H
charge: -0.337824 -0.257445 -0.599785 0.348394 -0.013075 -0.724069 -0.737602 0.335035 0.128539 -0.403108 -0.380171 -0.224534 -0.228619 -0.240264 0.221493 0.247569 0.229192 0.222628 0.264271 0.221903 0.275183 0.281902 0.332382 0.357241 0.226192 0.226693 0.227879
chargesum: 0.00000
title: Mulliken charges with hydrogens summed into heavy atoms:
elementType: O O N C C C C C C C C C C C
charge: -0.337824 -0.257445 0.089839 0.348394 -0.013075 -0.025815 -0.028801 0.335035 0.128539 -0.127925 -0.098269 0.001658 -0.001926 -0.012385
polarizability: 1.58519336e+02 1.67955822e+00 1.10171303e+02 2.98074822e+00 1.33242859e+01 1.09605980e+02
1716.lowfreq: -14.7883 -8.2767 -2.7594 -0.0003 0.0003 0.0004 46.4595 67.5692 94.3037
frequency: 46.4015 67.5570 94.2886 117.1567 131.2479 146.6094 171.6765 194.5643 252.3285 289.9438 318.0295 339.4366 372.3000 405.7318 425.5270 455.7003 501.2640 527.5983 573.0294 587.2763 613.9153 652.3779 661.6192 667.9804 706.7004 713.1426 758.9668 850.8619 864.0392 893.6373 931.5569 940.9022 948.8502 985.5402 990.4847 998.7360 999.9044 1032.4286 1062.0446 1064.3416 1084.9148 1115.2336 1171.8530 1188.6909 1229.5349 1257.8128 1315.4611 1340.6375 1352.6141 1377.6706 1389.1603 1399.5759 1433.2260 1452.3349 1459.8806 1476.1693 1479.1079 1481.4731 1561.1617 1586.6987 1611.2574 1633.8428 2989.0602 2993.1101 3074.9053 3081.4929 3109.2036 3115.0378 3124.4196 3136.1503 3150.9951 3161.2856 3169.7414 3495.6023 3660.0952
redmass: 4.1287 4.4824 4.4021 1.6505 1.5661 2.7340 3.2921 1.3606 3.6427 4.4587 3.9768 4.3667 2.5096 2.9043 3.3212 4.2562 4.1306 3.5025 2.6606 1.7476 6.3917 2.8563 1.6019 3.1966 2.3922 3.1738 1.7502 5.8696 1.2445 3.7295 1.8140 1.4309 1.8396 1.9538 2.5253 1.4568 1.5743 2.0252 2.0825 1.7890 1.6281 1.8258 1.0541 1.1187 3.5689 3.9964 1.3515 3.9931 4.2074 8.1412 1.2794 1.2126 2.2491 1.0483 1.0490 1.1078 1.1904 1.8589 1.3289 6.1698 5.9303 5.6720 1.0371 1.0370 1.0988 1.0983 1.0990 1.0987 1.0849 1.0890 1.0934 1.0959 1.0997 1.0446 1.1043
irintensity: 1.0230 6.1204 4.3596 0.2078 0.3396 4.7585 4.4359 1.0400 0.7628 3.9202 10.7328 0.1519 6.7373 0.1143 7.6865 8.2249 0.3197 3.8071 38.2816 142.8819 1.3591 106.5795 34.3358 2.1584 54.6277 7.8971 62.9405 14.2174 0.3695 5.1719 3.7430 1.7788 7.8172 0.5323 0.3045 2.8874 5.7299 5.9424 3.8432 14.5452 14.0569 11.6837 0.1749 6.9668 37.2989 3.3414 4.0423 64.5209 81.5705 0.1530 25.2506 21.4417 16.3626 5.0345 1.5235 4.0023 11.0256 26.7093 123.3558 0.6089 3.9455 256.3025 7.8927 37.1589 0.9963 30.9470 13.0158 10.7977 0.1353 15.7738 19.1881 12.3605 17.5102 40.1073 53.4195
temp: 298.150 k
press: 1.00000 atm
elementType: 8 8 7 6 6 6 6 6 6 6 6 6 6 6 1 1 1 1 1 1 1 1 1 1 1 1 1
symmnumber: 1
zpe: 568316.6 jmol-1
zpe.correction: 0.216460 hartree
zpe.thermalcorrener: 0.230153 hartree
zpe.thermalcorrenthalpy: 0.231097 hartree
zpe.thermalcorrgfe: 0.176362 hartree
zpe.sumelectzpe: -631.128557 hartree
zpe.sumelectthermal: -631.114864 hartree
zpe.sumelectthermalent: -631.113920 hartree
zpe.sumelectthermalfe: -631.168655 hartree
dipole: 1.1279 1.7362 0.8736
dipole: 2.2471
quadrupole: -69.9449 -84.5851 -80.4180
quadrupole: -0.7077 3.3553 -6.2352
quadrupole: 8.3711 -6.2691 -2.1020 -0.7077 3.3553 -6.2352
hfenergy: -631.345017 hartree
pointgroup: C01 [X(C11H13N1O2)]
dipole: 0.4368863 -0.3975898 -0.6577655 debye
polarizability: 158.210034|2.1247541|98.3791177|-4.7127588|6.4431709|121.707467 unknown
InChI: InChI=1S/C11H13NO2/c1-10(2)11(14-10,9(12)13)8-6-4-3-5-7-8/h3-7H,12H2,1-2H3
charge 0 multiplicity 1
27 atoms
O  1.289454 -0.110944 -1.494752
O  1.224574 1.520651 1.854343
N  2.07233 2.161302 -0.226838
C  1.585193 -1.095153 -0.352266
C  0.718737 0.138779 -0.115169
C  3.035247 -1.120597 0.10467
C  0.934149 -2.45635 -0.522429
C  -0.783966 0.053947 -0.000462
C  1.359488 1.331675 0.608706
C  -1.573667 -0.089413 -1.169202
C  -1.417746 0.124889 1.267919
C  -2.980739 -0.167054 -1.07272
C  -2.824848 0.042876 1.357898
C  -3.611281 -0.104261 0.191281
H  3.63894 -1.729866 -0.592194
H  3.472171 -0.11075 0.154037
H  3.105784 -1.577808 1.108445
H  0.944781 -3.002141 0.439034
H  -0.109538 -2.371166 -0.861194
H  1.498936 -3.053886 -1.260706
H  -1.072379 -0.137245 -2.141444
H  -0.808378 0.264249 2.166053
H  2.514237 2.998455 0.150493
H  2.160013 1.910676 -1.213511
H  -3.582739 -0.273474 -1.982255
H  -3.30707 0.097765 2.340391
H  -4.702882 -0.165353 0.266668
