program: Gaussian 09
title: 000228844
version: EM64L-G09RevD.01
frameworkgroup: C1[X(C11H12ClNO)]
method: RPBEPBE
basis: SDD
operation: Freq
keyword: #p
keyword: freq=noraman
keyword: PBEPBE/SDD
title: #p freq=noraman PBEPBE/SDD
converged: NO YES NO NO
title: Mulliken charges:
elementType: Cl O N C C C C C C C C C C C H H H H H H H H H H H H
charge: -0.070459 -0.429378 0.004036 -0.098380 0.141687 0.357054 -0.676085 -0.656546 -0.369392 -0.357745 -0.203619 -0.243413 -0.233067 -0.232345 0.243993 0.243210 0.265841 0.237579 0.245291 0.247796 0.251982 0.278483 0.353934 0.233235 0.232166 0.234143
chargesum: 0.00000
title: Mulliken charges with hydrogens summed into heavy atoms:
elementType: Cl O N C C C C C C C C C C C
charge: -0.070459 -0.075444 0.004036 -0.098380 0.141687 0.357054 0.076959 0.074120 -0.117410 -0.079263 -0.203619 -0.010178 -0.000901 0.001799
polarizability: 1.69068420e+02 9.44506873e+00 1.23864068e+02 -1.04323438e+01 1.35221361e+01 9.92778445e+01
1716.lowfreq: -5.0379 -0.0024 -0.0007 -0.0003 7.2533 10.5259 54.6804 72.0086 84.7761
frequency: 54.5943 71.9644 84.7634 124.5957 147.4695 216.6817 232.1414 243.6158 261.0890 268.4093 280.5048 306.0634 336.6841 353.1029 380.1030 405.8312 442.1019 450.7485 485.1910 501.8076 530.9945 589.9159 615.9261 616.7763 677.3846 706.8555 766.3489 861.1951 879.7549 903.3758 933.1718 942.3913 984.4109 986.5882 990.9733 995.0949 1004.5149 1028.9261 1042.5766 1096.0039 1117.8368 1163.3818 1175.8853 1193.1644 1209.9522 1227.8318 1314.1675 1331.6033 1382.6758 1386.4942 1402.6796 1436.1309 1451.5732 1460.3593 1471.7685 1480.1075 1482.6068 1593.3339 1610.0928 2186.2854 2995.0289 3001.1111 3090.8375 3097.8459 3111.9283 3119.2591 3128.7622 3136.4959 3148.8529 3164.3147 3180.2248 3462.1607
redmass: 3.8628 5.3613 5.3495 11.1237 6.4551 5.0758 1.4824 2.9999 5.0299 2.1001 1.0770 4.3694 3.6910 3.3196 4.7304 2.8723 6.8882 3.5080 3.2544 1.3963 4.7270 3.2618 6.4086 7.1693 5.7646 1.8718 1.7685 1.2416 3.6870 2.9834 1.4798 1.4032 1.5711 1.5989 5.2948 2.4257 1.5751 2.2679 2.8914 1.7469 1.7627 2.2367 1.0764 1.1436 2.4723 4.3609 1.4456 1.3736 7.6385 1.2393 1.1954 2.1946 1.0484 1.0479 1.0549 1.6245 1.2553 6.2732 5.9915 12.6868 1.0369 1.0366 1.0973 1.0975 1.1008 1.1008 1.0854 1.0889 1.0938 1.0986 1.0964 1.0646
irintensity: 0.3995 0.1064 0.7299 1.1595 1.3755 5.4432 0.7873 0.2191 7.8781 0.5571 0.1174 7.6882 11.1275 2.2925 7.0372 0.1751 4.8531 17.3651 63.1636 91.3491 5.1971 44.4709 0.0656 2.7126 0.5327 55.1999 62.6789 0.2104 8.4245 23.6509 12.5595 0.2729 10.7029 11.7982 1.4979 24.2421 6.1222 11.2478 27.8489 0.9201 72.8425 35.9285 1.3927 3.6103 21.9068 2.3308 20.6268 51.1776 2.3366 28.0950 26.0608 20.6834 2.6080 4.1608 7.8909 33.4415 5.4562 0.3367 1.1551 0.1549 5.6185 10.5067 6.6579 20.2408 8.8075 10.6741 0.9042 4.7691 22.6024 20.5581 6.2005 31.6209
temp: 298.150 k
press: 1.00000 atm
elementType: 17 8 7 6 6 6 6 6 6 6 6 6 6 6 1 1 1 1 1 1 1 1 1 1 1 1
symmnumber: 1
zpe: 529439.6 jmol-1
zpe.correction: 0.201653 hartree
zpe.thermalcorrener: 0.215624 hartree
zpe.thermalcorrenthalpy: 0.216569 hartree
zpe.thermalcorrgfe: 0.161558 hartree
zpe.sumelectzpe: -1015.358757 hartree
zpe.sumelectthermal: -1015.344785 hartree
zpe.sumelectthermalent: -1015.343841 hartree
zpe.sumelectthermalfe: -1015.398851 hartree
dipole: -2.3951 -3.4202 2.7256
dipole: 4.9863
quadrupole: -86.4436 -96.1684 -88.7773
quadrupole: -3.7137 -1.2854 5.9376
quadrupole: 4.0196 -5.7053 1.6858 -3.7137 -1.2854 5.9376
hfenergy: -1015.5604097 hartree
pointgroup: C01 [X(C11H12Cl1N1O1)]
dipole: 1.0239298 -1.4549127 -0.8266564 debye
dipolederiv: -0.8262034 0.0045817 0.1434826 -0.0435467 -0.2475728 -0.0371427 0.119223 -0.0581717 -0.3411766 -0.3922784 -0.0662286 0.0762019 -0.0221631 -0.6035171 -0.084949 0.1053656 0.0199745 -0.7037901 -0.1976881 0.0075432 -0.0010293 0.0194028 -0.2303594 -0.0180453 0.0087945 -0.0045058 -0.1999699 0.9556383 0.0137659 -0.2241485 0.0616034 0.2911421 0.0302414 -0.08384 0.0929902 0.3153669 0.3924105 -0.0023465 -0.060994 -0.0004572 0.5495945 0.0404021 -0.0851378 0.0220624 0.5519202 0.1646699 -0.0127374 0.0252638 -0.030843 -0.128423 -0.0288222 -0.1145847 -0.0329126 -0.0752777 -0.0963195 -0.0204695 0.0143045 -0.0290607 -0.057204 0.0007932 -0.0428259 0.0315352 -0.1816671 -0.0993813 0.001398 0.0110301 -0.0205073 -0.1842943 0.016452 -0.0079702 -0.0598894 -0.0438562 -0.0723418 -0.0628024 0.0408015 -0.0217709 -0.0415481 -0.0719561 -0.0278663 -0.0387344 -0.0723956 -0.109705 0.0642883 -0.0695884 -0.0477099 -0.0635768 -0.031373 0.0060792 -0.0914055 -0.0283655 -0.0799365 0.0045239 -0.0038777 -0.0158173 -0.0703789 0.0395287 0.025055 -0.0542575 -0.1017469 -0.0534763 0.0468124 -0.0762074 0.0706886 -0.0347207 -0.1213118 -0.081701 -0.1155989 -0.0162945 -0.018048 -0.096518 0.0663781 -0.0820926 -0.0279639 -0.1122713 0.0673769 -0.1019315 -0.04017 0.105636 -0.0242065 -0.0482291 -0.0272402 -0.0964908 -0.0455163 -0.037306 -0.0449649 -0.0865532 0.0275039 -0.0679302 -0.0891565 -0.0885058 0.0226546 -0.0844087 -0.04969 -0.0579416 0.0225497 -0.0687184 0.0204387 0.0797032 0.0302269 0.0914124 0.0331671 0.1102083 0.0140173 0.0688282 0.102128 0.0477426 0.0045248 0.0528771 -0.0636073 0.0328257 0.0295156 0.0159627 0.0997365 -0.0745855 0.0401796 0.0779008 0.0601957 0.0792485 0.0043009 0.0977552 0.0280268 0.0639031 0.0059492 -0.0885775 -0.071869 -0.0475915 0.0156414 -0.0529848 -0.0834347 -0.0754646 0.0482234 0.1129029 0.0249302 -0.0082425 0.0372348 0.0999171 0.0370073 -0.0020645 0.0892628 -0.0553774 0.0473271 0.0737954 -0.0477859 0.0840675 0.052697 0.0679432 -0.0554455 0.0657896 0.0778323 0.1191089 -0.0388653 0.05171 -0.0422622 0.0777205 0.0661486 0.0450871 0.0706061 0.0738417 0.134348 0.0640939 0.0549949 0.0324569 0.3488174 0.0792746 -0.0162408 0.0460795 0.4183573 0.0370618 -0.0336939 0.0598807 -0.0445033 0.0538014 0.1122722 0.0830175 0.1091612 0.0294443 0.006345 0.076532 -0.0467434 0.0915066 0.0429658 0.09972 -0.0537134 0.1016615 0.0586424 -0.122347 0.02375 0.041695 0.0238112 0.1240443 0.0287041 0.0443431 0.0286484 0.1179948 unknown
polarizability: 170.1158131|-8.2272095|117.4282254|-7.8702085|-17.3384771|104.6662943 unknown
InChI: InChI=1S/C11H12ClNO/c1-10(2,12)11(14,8-13)9-6-4-3-5-7-9/h3-7,14H,1-2H3
charge 0 multiplicity 1
26 atoms
Cl -3.463457 -0.699466 0.095478
O  -1.033038 -0.306739 1.863923
N  -1.645942 2.674638 0.252004
C  -1.602005 -0.80275 -0.524981
C  -0.808814 0.134409 0.486279
C  0.71148 0.055384 0.232291
C  -1.618724 -0.299591 -1.969542
C  -1.20355 -2.275118 -0.392684
C  1.329636 0.86785 -0.749228
C  1.494706 -0.855435 0.981465
C  -1.281315 1.542634 0.337667
C  2.716091 0.755385 -0.993753
C  2.881259 -0.962343 0.737318
C  3.495847 -0.163357 -0.254449
H  -2.265218 -0.948528 -2.582797
H  -0.595598 -0.337532 -2.387008
H  -1.995117 0.733947 -2.040225
H  -0.190549 -2.426074 -0.807507
H  -1.909855 -2.904399 -0.958127
H  -1.201798 -2.597723 0.660819
H  0.740382 1.605762 -1.305632
H  1.016953 -1.448001 1.765766
H  -2.019672 -0.367734 1.998126
H  3.186343 1.392659 -1.75033
H  3.482079 -1.662962 1.327416
H  4.572379 -0.245819 -0.440192
