program: Gaussian 09
title: 000228862
version: EM64L-G09RevD.01
frameworkgroup: C1[X(C20H36O3)]
method: RPBEPBE
basis: SDD
operation: Freq
keyword: #pfreq=noraman
keyword: PBEPBE/SDD
title: #p freq=noraman PBEPBE/SDD
converged: YES YES NO NO
title: Mulliken charges:
elementType: O O O C C C C C C C C C C C C C C C C C C C C H H H H H H H H H H H H H H H H H H H H H H H H H H H H H H H H H H H H
charge: -0.292521 -0.271767 -0.209482 0.351840 0.194689 -0.511533 -0.507359 -0.509788 -0.397565 -0.404152 -0.390677 0.124424 -0.378915 -0.380351 -0.390146 -0.261112 -0.386680 -0.381009 -0.666838 -0.374002 -0.352673 -0.357094 -0.696444 0.209754 0.209045 0.208097 0.222690 0.216377 0.238790 0.201650 0.204096 0.197858 0.226902 0.206008 0.191887 0.213259 0.202757 0.198027 0.199073 0.194982 0.195934 0.222085 0.236421 0.195611 0.194317 0.192227 0.191621 0.219633 0.254479 0.226199 0.189626 0.190432 0.187655 0.187210 0.194839 0.195237 0.209429 0.209621 0.215328
chargesum: 0.00000
title: Mulliken charges with hydrogens summed into heavy atoms:
elementType: O O O C C C C C C C C C C C C C C C C C C C C
charge: -0.292521 -0.271767 -0.209482 0.351840 0.194689 -0.092735 -0.076572 -0.054621 0.008181 0.020608 0.007218 0.124424 0.037100 0.016749 0.000771 0.197394 0.003249 0.002839 0.033474 0.006056 0.022192 0.032982 -0.062067
polarizability: 2.52823377e+02 -1.30773115e+00 2.13253182e+02 3.50614394e+00 -4.78267674e-01 2.02109081e+02
1716.lowfreq: -12.2011 -5.3135 -0.0014 -0.0009 0.0011 7.4299 13.4310 15.9011 23.6230
frequency: 12.8218 15.7892 22.8281 37.3603 45.1347 46.7003 60.9855 67.6744 75.4863 79.9935 81.9374 97.8905 113.3960 122.6863 124.5090 141.3426 151.3997 155.4438 163.1332 200.0417 215.6722 222.3079 229.9153 263.5132 290.0791 291.9836 321.7530 324.6489 337.0835 368.4170 376.6144 413.1895 424.8385 434.6779 441.9848 466.0698 486.6201 520.4157 528.5467 567.2227 698.6176 713.1017 721.5691 723.6147 729.9296 741.7167 750.4280 777.9537 783.6199 799.9852 811.0173 825.4209 836.5376 847.5514 869.5048 888.1902 894.8670 900.3496 913.3303 928.0627 965.9433 980.0426 984.0698 999.6239 1005.1684 1019.8140 1021.8966 1036.8620 1045.5481 1059.1330 1067.0600 1076.1689 1079.6485 1082.6899 1086.0194 1091.6816 1093.2339 1099.9025 1121.8066 1128.4581 1138.2860 1153.6691 1180.6156 1191.4839 1207.4316 1211.1901 1224.0061 1239.9131 1242.4338 1247.4285 1252.5796 1266.9038 1269.9291 1274.2844 1278.1639 1279.9466 1288.5578 1289.2811 1298.8116 1299.8497 1302.2953 1318.8448 1324.1935 1329.1201 1335.6895 1337.9541 1339.3383 1347.3321 1353.5442 1355.4771 1358.2729 1359.4808 1388.1668 1389.4145 1419.0518 1453.6876 1456.0421 1460.4116 1460.5359 1461.8978 1463.1551 1463.8146 1464.6063 1464.6734 1467.7689 1470.3812 1474.8607 1476.4242 1477.0977 1480.4494 1483.8092 1485.0832 1488.7720 1490.5858 1638.5594 2949.7478 2950.3882 2951.9491 2953.8212 2957.9384 2963.5200 2967.1458 2969.1067 2971.7331 2974.2057 2977.1656 2980.9797 2983.3884 2985.7738 2986.7663 2987.3618 2991.8006 2993.6897 2994.0164 3003.7337 3014.4894 3025.9624 3028.8589 3031.2591 3035.3117 3038.3456 3043.0243 3049.3250 3058.9791 3063.4863 3068.3415 3068.8475 3070.7478 3086.1293 3092.7930 3118.6529
redmass: 3.9566 4.5134 3.9353 3.6347 1.6230 3.6654 3.1774 2.2778 2.4754 3.1040 2.8845 3.0952 1.8515 2.8989 2.9178 2.7453 1.9668 2.0439 3.6771 1.7920 2.2294 2.4895 1.1378 2.3348 2.4196 2.7560 3.1851 3.6198 3.0290 3.4097 3.6273 3.4845 3.4585 2.9134 3.4263 3.1578 2.9198 2.3968 3.3180 3.6261 2.8753 5.3826 1.0597 1.0794 1.1512 2.4474 1.4661 1.4721 1.4539 1.7302 1.5937 2.5153 1.7601 1.5685 1.9161 1.9221 2.8886 2.2419 1.3965 1.4399 1.4465 2.6706 2.8922 4.0480 2.7386 2.9249 1.2748 2.4541 2.4208 2.9729 3.1249 2.4565 2.0984 2.3491 1.2047 1.4937 2.0047 1.9740 2.7609 2.1303 2.1513 1.6641 2.0378 2.0582 1.5713 1.3973 1.4921 1.5092 1.3664 1.3292 1.4705 1.4157 1.3221 1.3178 1.1161 1.0247 1.1337 1.0884 1.0920 1.1372 1.3139 1.5645 1.3777 1.3880 1.4597 1.4650 1.5379 1.4699 1.3079 1.6347 1.6027 1.6327 1.2295 1.2180 3.4769 1.0887 1.0914 1.0734 1.0757 1.0465 1.0918 1.0738 1.0859 1.0730 1.0814 1.0831 1.0820 1.0938 1.0426 1.0860 1.0520 1.0901 1.0925 1.0950 10.3757 1.0587 1.0586 1.0591 1.0593 1.0593 1.0589 1.0629 1.0583 1.0369 1.0605 1.0629 1.0652 1.0962 1.0622 1.0652 1.0973 1.0360 1.0672 1.0945 1.1014 1.1030 1.1035 1.0597 1.0960 1.1036 1.1011 1.1041 1.1011 1.1004 1.0978 1.1007 1.0960 1.0993 1.0976 1.1030 1.1062
irintensity: 0.4806 0.5855 0.1638 0.0063 0.0877 0.6313 0.3557 0.0999 0.0722 0.2788 0.0748 0.2026 0.0168 0.3444 0.2196 1.0906 0.0059 0.0486 0.9713 1.6414 0.1368 1.1561 0.0026 0.5651 1.7938 0.6946 10.1004 1.9934 0.3840 0.3522 2.1669 5.3457 3.2090 2.7300 1.4876 1.7270 1.0511 16.7911 6.7105 7.3144 8.7515 7.9929 18.4621 0.0325 6.5107 6.5010 4.3262 3.0381 0.4050 2.3358 3.1614 1.0948 2.9069 7.7586 2.0619 6.0740 13.6540 13.2804 6.8298 1.7734 1.6550 6.3809 7.2977 4.4195 25.7260 21.9939 5.7403 28.7742 31.7431 13.8113 58.5311 0.8600 0.6054 9.5812 11.9889 1.9511 42.5201 42.2957 16.7996 12.1586 4.8874 14.4464 8.8243 25.3294 4.9194 7.2363 4.0698 3.6787 1.1288 0.7997 14.9431 3.0438 6.3606 2.5110 2.2439 0.0242 1.9475 0.4311 0.0478 0.7788 0.2707 2.0423 2.4550 1.4375 0.3243 0.1429 0.9586 1.2500 0.2556 0.8704 0.2894 0.6630 26.0950 11.2374 2.2537 7.8516 6.9831 0.0137 0.3200 16.2686 0.1185 3.6988 7.9626 1.9187 9.0816 9.1956 3.2268 8.5238 11.6021 3.9256 14.4041 0.6036 7.9869 48.2416 158.2328 0.0246 0.0032 0.3506 2.4624 0.1638 62.3588 38.8282 151.9501 34.5458 54.1904 29.5774 2.4885 0.1998 39.0268 28.2115 0.3536 19.6496 30.5229 3.6429 0.0188 0.3800 2.4949 27.2108 59.0874 0.5604 57.1548 190.5372 58.8189 39.4166 87.4482 98.9172 32.7151 55.6827 36.1098 1.5263 26.6477
temp: 298.150 k
press: 1.00000 atm
elementType: 8 8 8 6 6 6 6 6 6 6 6 6 6 6 6 6 6 6 6 6 6 6 6 1 1 1 1 1 1 1 1 1 1 1 1 1 1 1 1 1 1 1 1 1 1 1 1 1 1 1 1 1 1 1 1 1 1 1 1
symmnumber: 1
zpe: 1373352.4 jmol-1
zpe.correction: 0.523082 hartree
zpe.thermalcorrener: 0.550731 hartree
zpe.thermalcorrenthalpy: 0.551675 hartree
zpe.thermalcorrgfe: 0.460501 hartree
zpe.sumelectzpe: -1007.507294 hartree
zpe.sumelectthermal: -1007.479646 hartree
zpe.sumelectthermalent: -1007.478701 hartree
zpe.sumelectthermalfe: -1007.569876 hartree
dipole: -1.6320 -0.7522 3.9853
dipole: 4.3717
quadrupole: -150.9213 -136.3830 -151.1301
quadrupole: -3.1779 19.6429 7.0775
quadrupole: -4.7765 9.7618 -4.9853 -3.1779 19.6429 7.0775
hfenergy: -1008.0303767 hartree
pointgroup: C01 [X(C20H36O3)]
dipole: -0.7022505 -0.3774349 1.5240294 debye
polarizability: 252.4645747|-2.0654216|213.3210856|5.2243914|0.0491646|202.3999799 unknown
InChI: InChI=1S/C20H36O3/c1-3-5-6-7-8-9-10-14-17-20(18(21)22-4-2)19(23-20)15-12-11-13-16-19/h3-17H2,1-2H3
charge 0 multiplicity 1
59 atoms
O  3.772881 -0.459904 -1.802369
O  2.696536 1.534602 0.984587
O  3.266655 2.470685 -1.076739
C  3.458019 -1.1081 -0.451898
C  2.659574 0.083545 -0.939518
C  2.901598 -2.527386 -0.514785
C  4.571731 -0.950844 0.580887
C  1.262519 -0.01467 -1.558187
C  2.433092 -3.003258 0.887199
C  4.10812 -1.42124 1.983976
C  3.560999 -2.867938 1.937257
C  2.94118 1.476786 -0.393341
C  0.101803 0.08702 -0.539902
C  -1.283308 -0.000942 -1.21848
C  -2.45275 0.118319 -0.215814
C  2.869619 2.87693 1.631498
C  -3.844673 0.020471 -0.879467
C  -5.009492 0.15159 0.127703
C  4.334688 3.116253 2.005945
C  -6.404873 0.044236 -0.527578
C  -7.566478 0.17958 0.482897
C  -8.963687 0.067061 -0.168745
C  -10.116457 0.201675 0.849914
H  2.080766 -2.606749 -1.247449
H  3.713859 -3.191764 -0.873245
H  5.426626 -1.572486 0.244968
H  4.927757 0.093238 0.61609
H  1.194042 -0.966439 -2.11524
H  1.172004 0.793223 -2.311448
H  1.561124 -2.39864 1.208923
H  2.089374 -4.05337 0.822914
H  4.955052 -1.354758 2.693762
H  3.320265 -0.734294 2.349197
H  3.188547 -3.167171 2.935875
H  4.385474 -3.564845 1.679485
H  0.173278 1.039125 0.021903
H  0.195097 -0.722068 0.21225
H  -1.369953 0.800749 -1.981338
H  -1.366062 -0.962429 -1.767255
H  -2.358116 -0.676061 0.554065
H  -2.372443 1.084811 0.324674
H  2.217275 2.820219 2.517506
H  2.503173 3.650267 0.933514
H  -3.938752 0.810364 -1.653799
H  -3.929421 -0.949249 -1.413424
H  -4.927498 1.124505 0.656474
H  -4.909966 -0.633581 0.90645
H  4.424821 4.06822 2.561577
H  4.963789 3.185548 1.102898
H  4.71577 2.304772 2.650171
H  -6.488989 -0.930112 -1.053345
H  -6.505098 0.827455 -1.308081
H  -7.485534 1.155393 1.006576
H  -7.465054 -0.601402 1.265643
H  -9.043692 -0.907641 -0.692308
H  -9.065115 0.847989 -0.949964
H  -10.054757 -0.587165 1.623412
H  -10.076865 1.179759 1.365885
H  -11.103974 0.117918 0.359745
