program: Gaussian 09
title: 000228842
version: EM64L-G09RevD.01
frameworkgroup: C1[X(C10H19BrO2)]
method: RPBEPBE
basis: SDD
operation: Freq
keyword: #p
keyword: freq=noraman
keyword: PBEPBE/SDD
title: #p freq=noraman PBEPBE/SDD
converged: YES YES NO NO
title: Mulliken charges:
elementType: Br O O C C C C C C C C C C H H H H H H H H H H H H H H H H H H H
charge: -0.007833 -0.264217 -0.229370 -0.375153 -0.329934 -0.347295 -0.627841 -0.357308 0.337815 -0.693662 0.032865 -0.676219 -0.684466 0.190806 0.219711 0.248449 0.229782 0.188736 0.197753 0.316709 0.194663 0.198497 0.212276 0.216875 0.210116 0.233638 0.213213 0.255505 0.226840 0.210588 0.231064 0.227394
chargesum: 0.00000
title: Mulliken charges with hydrogens summed into heavy atoms:
elementType: Br O O C C C C C C C C C C
charge: -0.007833 -0.264217 -0.229370 0.035364 0.148298 0.039194 -0.311132 0.035851 0.337815 -0.054394 0.266503 0.019340 -0.015420
polarizability: 1.56766950e+02 -6.18624359e+00 1.41626845e+02 1.76225781e+00 2.59714040e+00 1.03946129e+02
1716.lowfreq: -10.4010 -9.6526 -0.0007 -0.0006 0.0002 5.4092 22.4292 29.0132 40.4080
frequency: 21.9589 28.7166 40.3743 52.2802 67.0903 88.2852 104.4348 124.3982 137.0576 158.9146 174.0997 181.2156 204.8760 230.1992 232.5277 273.5431 302.9803 361.9144 391.3827 415.7445 442.6752 499.5364 568.5017 647.2794 727.0529 734.8937 757.7823 771.2775 829.1225 874.5417 889.9846 908.9072 930.1487 941.1884 970.2652 1000.3280 1038.7503 1060.4531 1077.1993 1092.1820 1108.7732 1115.7717 1132.4242 1159.1987 1177.2733 1186.2109 1205.2955 1245.4004 1256.8646 1288.4971 1292.3024 1302.1663 1318.1672 1334.9246 1339.6636 1348.5248 1351.6073 1382.8617 1388.5451 1399.0764 1453.9074 1456.9651 1463.1882 1465.2432 1468.4699 1472.2062 1477.3040 1478.3260 1486.8054 1487.3152 1627.1848 2957.9108 2964.1717 2971.3267 2972.9149 2991.6248 2994.4856 2998.1577 3009.3351 3017.9945 3025.8476 3039.0451 3069.3917 3073.1058 3074.8838 3087.0348 3094.5509 3098.4414 3099.8117 3106.1965
redmass: 3.8616 2.3572 2.1464 3.0412 5.2230 5.9214 3.0594 1.8803 3.1811 4.4795 3.1221 1.0350 5.0958 1.1127 1.2159 4.1340 2.7250 2.8969 3.7333 3.4508 2.6260 3.0133 6.1911 3.4500 1.0936 5.7154 1.3116 3.1034 1.8446 1.9369 1.9409 2.5928 1.2482 1.3425 1.3309 3.6547 3.2653 2.0929 2.2431 2.0881 1.7817 2.4892 1.6205 2.0569 1.5994 1.8568 1.5476 1.2857 1.3104 1.0664 1.1442 1.3179 1.2554 1.4651 1.4181 1.5826 1.6025 1.2544 1.2142 1.2251 1.0864 1.0511 1.0679 1.0479 1.0759 1.0499 1.0426 1.0746 1.0850 1.0488 9.9730 1.0587 1.0597 1.0597 1.0365 1.0356 1.0359 1.0973 1.0622 1.0988 1.0864 1.1038 1.1009 1.0993 1.1010 1.0991 1.0988 1.0902 1.1007 1.1007
irintensity: 0.8204 0.0136 0.1131 0.7413 0.3630 0.6571 0.5141 0.2408 1.0567 2.9649 2.2828 0.0337 0.9448 0.0026 0.0670 9.0379 1.8343 1.0091 6.5351 10.1549 1.2878 5.4447 33.4658 5.1801 13.1543 4.6213 3.4588 9.0858 4.6734 2.6959 1.4853 28.9805 2.6488 0.0621 5.2020 1.3904 15.5015 30.5735 2.3640 281.0526 35.1594 35.4380 76.7181 12.5220 43.2044 1.1186 15.8843 18.0050 12.5835 2.3248 4.4655 15.2823 13.3274 3.9506 1.0953 19.5380 1.4996 32.6553 11.5651 17.6433 7.5955 5.9432 0.2435 4.2311 1.3558 7.4821 12.6546 5.1257 19.2970 20.5326 157.3555 1.9138 1.3647 95.4886 36.6458 13.7785 20.6997 0.5903 18.7234 3.7868 6.7405 44.8333 65.2684 51.1944 40.8518 5.0441 45.8752 10.0770 21.1334 29.0566
temp: 298.150 k
press: 1.00000 atm
elementType: 35 8 8 6 6 6 6 6 6 6 6 6 6 1 1 1 1 1 1 1 1 1 1 1 1 1 1 1 1 1 1 1
symmnumber: 1
zpe: 715790.1 jmol-1
zpe.correction: 0.272630 hartree
zpe.thermalcorrener: 0.289839 hartree
zpe.thermalcorrenthalpy: 0.290783 hartree
zpe.thermalcorrgfe: 0.224170 hartree
zpe.sumelectzpe: -555.316994 hartree
zpe.sumelectthermal: -555.299785 hartree
zpe.sumelectthermalent: -555.298841 hartree
zpe.sumelectthermalfe: -555.365454 hartree
dipole: 0.2904 -2.3881 -1.5192
dipole: 2.8452
quadrupole: -81.7351 -88.2114 -94.1886
quadrupole: 7.4761 -1.5505 0.8243
quadrupole: 6.3099 -0.1663 -6.1436 7.4761 -1.5505 0.8243
hfenergy: -555.5896241 hartree
pointgroup: C01 [X(C10H19Br1O2)]
dipole: 0.0962168 1.0463058 0.3860447 debye
polarizability: 155.2446329|5.9597116|141.7114727|-7.2999829|-5.8598499|105.3838194 unknown
InChI: InChI=1S/C10H19BrO2/c1-4-5-6-7-9(11)10(12)13-8(2)3/h8-9H,4-7H2,1-3H3
charge 0 multiplicity 1
32 atoms
Br -1.324798 -2.837956 1.007502
O  -2.016513 0.59071 0.739991
O  -1.026019 -0.081987 -1.269797
C  1.982783 -0.026872 0.376877
C  1.118288 -1.314911 0.347696
C  3.421508 -0.288914 -0.125798
C  -0.293336 -1.061385 0.878072
C  4.303912 0.979986 -0.115548
C  -1.132168 -0.159467 -0.023783
C  5.737639 0.714582 -0.623991
C  -2.984315 1.485242 -0.008258
C  -4.166185 0.630344 -0.485096
C  -3.361642 2.584888 0.984984
H  2.023166 0.376798 1.409956
H  1.513689 0.750944 -0.257422
H  1.050906 -1.694014 -0.687999
H  1.597479 -2.097023 0.96489
H  3.896455 -1.070933 0.502578
H  3.379544 -0.697288 -1.156429
H  -0.313744 -0.689863 1.914018
H  4.344997 1.388774 0.91468
H  3.826311 1.760354 -0.742245
H  5.724834 0.331679 -1.661898
H  6.348963 1.635481 -0.611137
H  6.248246 -0.039243 0.004646
H  -2.433419 1.892668 -0.876668
H  -4.90059 1.268293 -1.010143
H  -3.829331 -0.152895 -1.184538
H  -4.669651 0.152267 0.373379
H  -4.054547 3.299688 0.505464
H  -2.467867 3.137801 1.321033
H  -3.861395 2.15575 1.870883
