program: Gaussian 09
title: 000228907
version: EM64L-G09RevD.01
frameworkgroup: C1[X(C18H16O2)]
method: RPBEPBE
basis: SDD
operation: Freq
keyword: #pfreq=noraman
keyword: PBEPBE/SDD
title: #p freq=noraman PBEPBE/SDD
converged: YES YES NO NO
title: Mulliken charges:
elementType: O O C C C C C C C C C C C C C C C C C C H H H H H H H H H H H H H H H H
charge: -0.418989 -0.224674 -0.072526 -0.591531 -0.616118 -0.207490 0.400615 0.403016 0.405658 0.388979 -0.764576 0.132207 -0.478698 -0.483684 -0.483966 -0.455568 -0.236936 -0.237261 -0.238519 -0.239726 0.264216 0.246104 0.279979 0.282792 0.242558 0.232374 0.212697 0.242695 0.242716 0.247470 0.248458 0.224826 0.223374 0.225013 0.224607 0.379907
chargesum: 0.00000
title: Mulliken charges with hydrogens summed into heavy atoms:
elementType: O O C C C C C C C C C C C C C C C C C C
charge: -0.039081 -0.224674 0.191690 -0.345427 -0.336139 0.075302 0.400615 0.403016 0.405658 0.388979 -0.076947 0.132207 -0.236003 -0.240968 -0.236495 -0.207110 -0.012110 -0.013887 -0.013506 -0.015120
polarizability: 2.15451409e+02 -1.69049401e+01 1.61193018e+02 4.32751029e+00 3.48268665e+00 1.80152497e+02
1716.lowfreq: -10.1474 -6.4481 -0.0003 0.0005 0.0008 10.5683 32.3394 55.4725 64.7000
frequency: 32.3378 55.4591 64.6948 94.3326 134.8144 142.1359 161.0101 217.1225 226.4974 239.1124 300.1359 314.0154 347.3669 364.4998 368.4575 399.2091 440.5963 456.7301 485.2235 504.8045 536.3658 556.5956 580.4340 601.4281 622.0720 634.8902 645.6778 672.4612 709.2303 753.7758 755.5051 766.2741 779.9085 784.7295 810.1822 830.1862 859.7328 872.0778 884.5770 894.0036 912.8270 944.0118 947.4836 950.8726 984.4043 985.2861 996.6637 1023.4551 1024.3954 1034.2546 1061.8787 1079.1979 1098.0201 1103.4857 1119.6027 1167.2995 1170.5192 1171.7456 1172.3233 1191.0592 1195.1897 1210.9309 1215.8335 1220.7852 1231.3137 1255.2342 1280.7870 1296.2481 1304.2434 1314.0767 1331.0305 1343.3178 1386.4445 1393.2127 1395.5491 1444.4084 1450.7243 1464.1045 1475.1964 1479.8996 1481.3696 1592.9554 1599.1302 1613.2671 1621.7771 1651.1299 2975.7347 2976.6555 3023.2886 3043.7465 3071.1944 3074.9258 3082.7675 3118.4988 3119.0643 3124.8867 3129.8152 3138.9983 3143.0777 3159.2751 3160.5064 3508.8315
redmass: 9.2805 6.4957 4.9818 3.7673 4.5615 3.7809 4.3999 2.6086 2.8341 1.3340 5.7075 4.1234 4.0073 3.9868 4.3468 4.4091 3.5746 3.8277 4.6223 4.7732 3.0183 3.7339 2.4968 3.9482 3.8155 2.9508 4.2899 3.0570 4.6828 2.2869 1.9487 1.5121 3.1431 4.2174 2.7254 3.7204 1.9383 1.5952 3.1032 2.2346 2.6539 1.4425 1.4473 3.3908 1.3188 1.3249 2.6120 2.2437 2.2479 2.1447 2.0087 2.1964 2.3529 1.9834 1.6682 1.7255 1.1023 1.3874 1.8682 1.2403 1.3839 1.4560 1.7237 1.9709 2.0828 1.4654 1.6582 1.4469 1.7202 1.5915 1.4225 1.4541 1.2332 6.3822 6.1359 2.3947 2.4725 2.3436 1.0613 1.0509 2.7783 6.2215 7.1158 6.9821 7.1648 9.1323 1.0498 1.0666 1.0859 1.0876 1.0989 1.0879 1.0995 1.0857 1.0860 1.0896 1.0889 1.0941 1.0944 1.1003 1.1004 1.0639
irintensity: 1.2445 0.5775 0.5904 0.8521 0.1812 0.0390 0.1846 0.3834 0.3469 0.2856 3.4446 0.5160 1.1361 2.0298 0.0701 3.8606 2.0898 0.6972 4.5579 0.5848 13.8672 79.5243 32.8960 7.2154 28.7862 34.4770 15.8573 29.3909 16.6969 11.6721 19.8463 91.4678 6.3822 6.1297 0.8202 0.9155 1.1660 0.3944 1.5090 2.4583 3.0795 1.8379 0.8406 27.6030 0.0294 0.0882 14.4317 0.7658 7.7223 87.9945 60.8371 73.8032 25.8966 9.3422 10.5571 0.6098 0.4474 2.7390 4.4932 1.6012 2.5792 1.7975 6.6360 3.2213 14.9664 6.8762 5.0563 4.2747 22.2194 14.4049 0.3983 4.7844 15.5867 0.0347 0.4099 11.7283 0.3214 37.9801 2.4771 6.8231 10.2014 1.9170 0.1370 0.1337 0.1272 196.9421 32.7812 9.6667 9.8933 22.1542 40.5537 7.0188 22.3182 2.6876 3.7241 2.6383 6.6725 27.8123 29.8701 45.2959 27.8169 21.5440
temp: 298.150 k
press: 1.00000 atm
elementType: 8 8 6 6 6 6 6 6 6 6 6 6 6 6 6 6 6 6 6 6 1 1 1 1 1 1 1 1 1 1 1 1 1 1 1 1
symmnumber: 1
zpe: 760447.4 jmol-1
zpe.correction: 0.289639 hartree
zpe.thermalcorrener: 0.305444 hartree
zpe.thermalcorrenthalpy: 0.306388 hartree
zpe.thermalcorrgfe: 0.246419 hartree
zpe.sumelectzpe: -844.588720 hartree
zpe.sumelectthermal: -844.572915 hartree
zpe.sumelectthermalent: -844.571971 hartree
zpe.sumelectthermalfe: -844.631940 hartree
dipole: 0.5829 -0.9001 1.3946
dipole: 1.7593
quadrupole: -110.5744 -113.5064 -110.3445
quadrupole: 0.3589 -3.1888 1.2684
quadrupole: 0.9007 -2.0313 1.1306 0.3589 -3.1888 1.2684
hfenergy: -844.8783593 hartree
pointgroup: C01 [X(C18H16O2)]
dipole: -0.237862 -0.3394108 -0.5543358 debye
polarizability: 216.9070656|14.0342717|159.6113373|4.8386145|-3.5456016|180.2785206 unknown
InChI: InChI=1S/C18H16O2/c1-10-15-11-6-2-4-8-13(11)17(16(10)18(19)20)14-9-5-3-7-12(14)15/h2-10,15-17,19H,1H3
charge 0 multiplicity 1
36 atoms
O  2.146835 -3.197558 -0.2924
O  2.422846 -1.955307 1.643428
C  0.21234 -1.32485 -1.279062
C  -0.35912 0.14587 -1.426074
C  0.091935 -0.328921 1.11004
C  0.388816 -1.62281 0.260751
C  -1.615148 0.254399 -0.565286
C  0.697595 1.068592 -0.824257
C  -1.368146 0.00891 0.813832
C  0.956113 0.797844 0.546844
C  -0.671645 -2.377366 -1.975712
C  1.737764 -2.220203 0.631212
C  -2.915691 0.560166 -1.008069
C  1.407619 2.082902 -1.494149
C  -2.419134 0.069553 1.747693
C  1.924743 1.537975 1.249421
C  -3.975305 0.626565 -0.068369
C  2.377489 2.836005 -0.78606
C  -3.728401 0.38325 1.302761
C  2.635074 2.564052 0.578033
H  1.20755 -1.329969 -1.759399
H  -0.556098 0.365075 -2.490186
H  0.286597 -0.515053 2.178233
H  -0.361105 -2.390276 0.545313
H  -0.237361 -3.385397 -1.853225
H  -1.693554 -2.381832 -1.55314
H  -0.751999 -2.171746 -3.059515
H  -3.107687 0.750024 -2.070812
H  1.209439 2.292074 -2.552138
H  -2.226369 -0.118908 2.810419
H  2.133666 1.313479 2.301102
H  -4.989422 0.870439 -0.404589
H  2.93024 3.632707 -1.296822
H  -4.551629 0.440252 2.023773
H  3.389008 3.148724 1.117087
H  3.012845 -3.584859 0.010923
