program: Gaussian 09
title: 000228832
version: EM64L-G09RevD.01
frameworkgroup: C1[X(C14H8N4O3)]
method: RPBEPBE
basis: SDD
operation: Freq
keyword: #p
keyword: freq=noraman
keyword: PBEPBE/SDD
title: #p freq=noraman PBEPBE/SDD
converged: NO NO NO NO
title: Mulliken charges:
elementType: O O O N N N N C C C C C C C C C C C C C C H H H H H H H H
charge: -0.217775 -0.225729 -0.213212 0.071333 -0.414201 -0.050253 -0.603506 0.329253 -0.163929 0.247690 0.336470 -0.110044 -0.564942 -0.040413 0.148542 -0.385101 -0.389614 0.133886 -0.232838 -0.226689 0.189865 0.286129 0.294403 0.290423 0.236187 0.235841 0.339341 0.332636 0.366245
chargesum: 0.00000
title: Mulliken charges with hydrogens summed into heavy atoms:
elementType: O O O N N N N C C C C C C C C C C C C C C
charge: -0.217775 -0.225729 -0.213212 0.071333 -0.074860 -0.050253 0.095375 0.329253 -0.163929 0.247690 0.336470 -0.110044 -0.278813 -0.040413 0.148542 -0.090697 -0.099191 0.133886 0.003349 0.009152 0.189865
polarizability: 4.31243880e+02 1.04953036e+01 2.18693522e+02 -7.92656585e-04 -2.44023537e-04 6.99648239e+01
1716.lowfreq: -0.0010 0.0005 0.0008 4.7146 6.4693 11.1306 40.3374 56.2258 113.3262
frequency: 40.3044 56.2129 113.3260 127.5557 153.2025 159.2733 161.5915 226.7843 242.9907 243.9013 278.5563 313.6857 345.2899 365.4067 376.1015 421.9846 430.7056 436.5849 471.0352 488.4732 509.6637 518.9269 558.6562 568.4696 587.8937 606.9492 624.4601 656.3267 670.8504 670.8625 677.6858 700.5194 717.3340 739.2158 765.7557 787.6281 793.8900 801.7195 824.4837 879.2285 921.6474 944.9607 997.4497 997.6575 1013.6121 1025.4910 1032.7077 1065.5075 1080.3146 1099.1400 1122.1912 1142.8359 1172.8685 1221.1588 1265.8940 1295.6988 1299.9797 1320.6389 1330.2808 1381.2414 1392.2519 1449.3247 1454.2781 1467.5239 1490.3484 1496.6990 1533.4908 1566.5837 1576.6210 1611.1169 1621.7044 1632.9959 1663.7323 3133.6723 3149.7317 3162.2296 3171.4757 3179.3907 3501.3405 3547.0489 3697.9461
redmass: 7.5478 7.1399 5.5903 6.4206 6.0670 6.3173 6.3196 6.4901 7.7804 5.8744 9.3479 7.6996 4.6959 1.2680 3.3590 7.3541 9.4740 3.9105 7.8737 9.0358 10.3621 3.9936 1.1816 8.5798 7.1068 5.8743 3.0969 7.3949 6.8758 3.4230 3.2527 5.6343 2.5169 6.2884 7.0992 6.2005 1.4014 2.7248 5.9589 1.6679 1.5795 7.9814 1.3825 2.8526 1.3464 3.3992 2.9961 3.6305 2.6936 4.4748 1.6532 5.2130 1.1190 1.8739 1.8800 4.4329 3.2750 6.0922 1.8739 3.9703 8.1253 3.2021 5.4939 4.5593 5.8834 6.7439 8.8727 6.0715 2.6387 6.4448 6.1737 1.8142 6.5448 1.0862 1.0904 1.0951 1.0996 1.0927 1.0778 1.0460 1.1053
irintensity: 7.0196 1.3764 0.0002 2.9388 0.3113 0.2256 11.2591 4.1648 0.2967 0.9089 0.1952 15.1091 0.5605 51.1057 5.6306 0.5029 10.0459 2.6037 5.7388 6.2283 0.3321 1.1569 270.0882 3.4982 10.0791 4.8597 12.8560 0.9271 1.8318 17.6961 7.3041 7.9058 70.8767 6.5446 35.3813 9.6146 88.1707 4.6997 11.4816 26.3311 1.5329 22.1622 3.8015 51.2493 0.0002 5.0117 2.5552 1.0089 45.0588 16.7344 37.3318 68.0332 3.4350 5.0411 7.6756 135.1383 7.2301 49.4235 16.8306 2.4826 115.4031 22.0294 303.3099 351.0211 71.0645 133.8187 150.1293 91.4848 730.4931 23.6248 143.4468 817.6490 411.1388 4.2642 9.4170 6.8028 28.2042 0.9278 37.4099 281.8825 58.2442
temp: 298.150 k
press: 1.00000 atm
elementType: 8 8 8 7 7 7 7 6 6 6 6 6 6 6 6 6 6 6 6 6 6 1 1 1 1 1 1 1 1
symmnumber: 1
zpe: 528416.1 jmol-1
zpe.correction: 0.201263 hartree
zpe.thermalcorrener: 0.216874 hartree
zpe.thermalcorrenthalpy: 0.217818 hartree
zpe.thermalcorrgfe: 0.158552 hartree
zpe.sumelectzpe: -981.564862 hartree
zpe.sumelectthermal: -981.549251 hartree
zpe.sumelectthermalent: -981.548307 hartree
zpe.sumelectthermalfe: -981.607573 hartree
dipole: 9.0266 0.9813 0.0000
dipole: 9.0798
quadrupole: -64.9394 -136.0985 -121.8207
quadrupole: -22.9344 0.0020 -0.0008
quadrupole: 42.6802 -28.4790 -14.2012 -22.9344 0.0020 -0.0008
hfenergy: -981.7661253 hartree
pointgroup: C01 [X(C14H8N4O3)]
dipole: -3.5475933 -0.4191161 0.0003385 debye
polarizability: 431.0299849|12.4727121|218.9074087|-0.0285704|-0.0308839|69.9648322 unknown
InChI: InChI=1S/C14H8N4O3/c15-14-17-12(20)11-13(18-14)21-9-5-8(19)6-3-1-2-4-7(6)10(9)16-11/h1-5,17H,15H2
charge 0 multiplicity 1
29 atoms
O  -1.067795 1.694431 -0.000898
O  3.613138 2.718163 -0.001295
O  -2.791312 -2.864598 0.000375
N  -0.437976 -1.095137 -0.000368
N  -4.153767 -0.967402 -0.000032
N  -3.331195 1.27712 -0.000634
N  -5.629079 0.899178 -0.000205
C  1.95345 -0.611594 -0.000592
C  0.547405 -0.187232 -0.000563
C  2.994764 0.368571 -0.000851
C  0.289813 1.259379 -0.000852
C  -1.748649 -0.63609 -0.000401
C  1.270173 2.218224 -0.001088
C  2.685711 1.835963 -0.001159
C  -2.083897 0.743513 -0.000634
C  2.288526 -1.994295 -0.000342
C  4.349168 -0.048875 -0.000841
C  -2.847373 -1.608968 -0.00022
C  3.636599 -2.392929 -0.000342
C  4.67163 -1.418656 -0.00059
C  -4.353045 0.398302 -0.000299
H  1.020948 3.2826 -0.00126
H  1.473856 -2.724548 -0.000141
H  5.122093 0.726288 -0.001045
H  3.889156 -3.458781 -0.000146
H  5.720306 -1.735495 -0.000595
H  -4.935617 -1.631014 0.000257
H  -6.460486 0.314317 0.000064
H  -5.722544 1.913664 -0.000404
