program: Gaussian 09
title: 000228827
version: EM64L-G09RevD.01
frameworkgroup: C1[X(C7H8N6O2)]
method: RPBEPBE
basis: SDD
operation: Freq
keyword: #pfreq=noraman
keyword: PBEPBE/SDD
title: #p freq=noraman PBEPBE/SDD
converged: NO NO NO NO
title: Mulliken charges:
elementType: O O N N N N N N C C C C C C C H H H H H H H H
charge: -0.249500 -0.207341 -0.180595 -0.223545 -0.090278 0.010485 -0.104908 -0.582214 0.210202 -0.104737 0.229700 0.193828 -0.609476 -0.595023 0.054675 0.274936 0.250638 0.250631 0.253276 0.253221 0.273651 0.351271 0.341103
chargesum: 0.00000
title: Mulliken charges with hydrogens summed into heavy atoms:
elementType: O O N N N N N N C C C C C C C
charge: -0.249500 -0.207341 -0.180595 -0.223545 -0.090278 0.010485 -0.104908 0.110160 0.210202 -0.104737 0.229700 0.193828 0.166729 0.185125 0.054675
polarizability: 2.01617648e+02 -1.65495342e+00 1.37216466e+02 -1.32855296e-02 -2.66851368e-03 5.91544204e+01
1716.lowfreq: -7.5894 -2.5810 -0.0011 -0.0009 -0.0007 6.7543 63.5017 69.1633 111.2000
frequency: 63.4658 69.1604 111.1850 116.2342 121.7080 148.3780 217.1857 227.7192 302.1091 310.0934 319.5204 360.5106 363.8236 394.0360 415.7788 453.4567 455.6437 490.6241 533.9938 581.2238 604.2953 662.8385 669.7513 679.7158 710.7639 728.7524 787.4068 796.6562 856.8402 924.5146 966.1539 1034.0609 1040.4362 1083.6726 1129.5750 1130.8453 1150.0766 1216.5991 1233.4522 1250.6583 1255.9564 1333.3356 1363.7778 1416.6938 1426.9859 1464.6251 1475.3646 1476.1287 1477.4319 1491.5064 1506.3035 1523.4796 1602.2692 1616.9590 1643.2864 3016.3302 3017.9334 3109.4637 3110.5277 3145.6452 3147.5328 3544.6127 3700.9722
redmass: 4.2040 9.1049 1.7149 1.0313 1.8377 4.1960 4.2059 6.4472 6.9518 3.0502 6.3506 4.6367 3.8230 8.2720 6.8387 6.4793 6.0791 8.3636 1.1978 1.1334 6.8882 10.4861 10.8812 7.2914 11.2663 11.0522 5.5249 11.9447 6.0732 3.4472 5.5402 2.7920 2.9063 2.4142 1.3007 1.3088 7.9023 5.9757 3.9681 3.2853 5.2302 5.9566 4.1350 1.3583 1.2550 1.7975 1.0810 1.0433 1.0432 2.2385 4.9987 2.3690 10.5225 1.8656 8.2763 1.0330 1.0331 1.1024 1.1024 1.1024 1.1021 1.0444 1.1058
irintensity: 2.9763 5.0304 2.2226 0.4996 3.0034 1.1766 1.5081 5.4616 1.7802 2.1136 6.2468 12.7095 1.3653 33.6156 1.2045 25.3072 0.9054 1.1106 151.2628 147.2711 3.1769 2.3599 7.6684 1.2898 17.5438 0.8759 3.1775 22.4978 17.8551 11.8600 14.7073 11.1455 61.6235 72.4208 0.2583 0.0170 106.7942 60.1887 7.8396 68.8065 1.8144 154.6687 49.6696 1.1311 146.1332 36.9100 16.0826 22.7435 15.1475 86.3049 775.9462 64.3801 578.9387 506.2062 45.4172 24.9920 20.2555 12.4897 16.6548 1.0464 0.3832 185.2540 59.1943
temp: 298.150 k
press: 1.00000 atm
elementType: 8 8 7 7 7 7 7 7 6 6 6 6 6 6 6 1 1 1 1 1 1 1 1
symmnumber: 1
zpe: 434125.0 jmol-1
zpe.correction: 0.165349 hartree
zpe.thermalcorrener: 0.178592 hartree
zpe.thermalcorrenthalpy: 0.179536 hartree
zpe.thermalcorrgfe: 0.125636 hartree
zpe.sumelectzpe: -749.426330 hartree
zpe.sumelectthermal: -749.413088 hartree
zpe.sumelectthermalent: -749.412143 hartree
zpe.sumelectthermalfe: -749.466044 hartree
dipole: 3.3357 5.1750 0.0006
dipole: 6.1569
quadrupole: -68.4711 -101.7506 -85.1901
quadrupole: 12.9851 -0.0011 -0.0024
quadrupole: 16.6661 -16.6133 -0.0528 12.9851 -0.0011 -0.0024
hfenergy: -749.5916797 hartree
pointgroup: C01 [X(C7H8N6O2)]
dipole: -1.1942482 -2.1074739 0.0014822 debye
dipolederiv: -1.1013291 0.3737863 -0.000143 0.3947444 -0.8172083 0.0001941 -0.000194 0.0002056 -0.3519416 -0.6076194 -0.2150216 0.0000685 -0.2244989 -1.1381233 0.0001134 0.0004024 0.0010234 -0.318253 -1.6051856 0.2664894 -0.000096 0.1739909 -0.6974956 0.000299 0.0001016 0.000217 -0.1997695 -0.8226829 0.2660677 -0.0003091 0.2145547 -1.3051884 0.0005135 0.0005936 0.0004149 -0.2080102 -1.3969674 0.0150878 -0.0000159 0.1787409 -0.3151357 0.0000639 0.0000541 -0.0000787 -0.2670339 1.1178158 -0.1723215 0.0001111 -0.0476404 0.0264191 -0.0001175 0.0000966 -0.0002767 -0.2209626 -0.9922235 0.1075194 -0.0000388 -1.0210266 -0.3465848 0.0000227 0.0005456 0.0000844 -0.2151006 -1.6070025 -0.356108 0.0001876 -0.642753 -0.3028389 -0.0002433 0.0003287 -0.0002186 -0.665265 1.3507878 -0.3397136 0.0000928 -0.6261253 0.68777 -0.000174 0.0000053 -0.0001294 0.2520043 -0.9956914 -0.1819602 0.0002049 0.461271 -0.521425 0.0003214 -0.0006058 0.0003745 0.1004776 1.863656 -0.1625102 0.000093 -0.0348205 1.4474036 -0.0006118 0.0001123 -0.0006508 0.2743723 1.4666964 -0.041295 0.0000172 0.0311277 1.5355516 -0.0002901 0.0000075 -0.00083 0.2331429 0.0287409 0.0171996 0.0000048 0.0442216 0.4248167 -0.0001757 -0.0000366 -0.0001536 0.1811163 0.3647165 0.0950238 0.0003343 0.1841113 0.0830593 0.0002254 -0.0000315 0.00026 0.1983378 1.9933064 0.2884665 -0.0001118 0.8463939 0.4933784 -0.000103 -0.00048 -0.0000425 0.314752 0.0315401 0.1386531 -0.0000215 0.0134061 0.1261574 0.0000011 0.000028 -0.000008 0.1323129 0.0658213 -0.0819853 -0.0891605 -0.0112818 0.0254255 -0.0014895 -0.0664595 -0.050329 -0.0341326 0.0659079 -0.0818614 0.089198 -0.0112088 0.0254215 0.0014616 0.0664254 0.0503418 -0.0343088 -0.0022712 -0.0177718 0.0421294 0.0431824 0.0959637 -0.081441 0.0752406 -0.0353249 -0.0338714 -0.0028489 -0.0181511 -0.04218 0.0421071 0.0964359 0.0805097 -0.075905 0.0345099 -0.0354087 0.1837514 0.0624538 -0.0003237 -0.0848375 -0.0051159 0.0006911 -0.0001651 0.0003806 0.1300085 0.3651464 -0.0015114 -0.0000065 -0.0574785 0.1674269 0.0001248 0.0000347 0.0001295 0.384685 0.2359351 0.0394637 -0.0000349 0.1338192 0.2138864 0.0001044 -0.0000989 0.0001005 0.3828482 unknown
polarizability: 201.5969011|2.0185766|137.2371934|0.0038819|-0.040603|59.1544404 unknown
InChI: InChI=1S/C7H8N6O2/c1-12-4-3(10-11-6(8)9-4)5(14)13(2)7(12)15/h8H2,1-2H3
charge 0 multiplicity 1
23 atoms
O  2.903949 -1.66477 0.00012
O  1.24475 2.715133 -0.002373
N  0.575429 -1.39085 0.000212
N  2.057713 0.512289 -0.001067
N  -1.763619 -1.107596 0.00018
N  -1.446129 1.715783 -0.001474
N  -2.691027 1.191126 -0.001255
N  -4.076633 -0.691163 -0.000218
C  -0.522496 -0.544967 -0.000088
C  -0.35309 0.8756 -0.00084
C  1.909862 -0.888807 -0.000251
C  0.993976 1.483512 -0.000731
C  0.376222 -2.858872 0.001002
C  3.455031 1.010986 -0.001783
C  -2.798987 -0.217807 -0.000411
H  1.371473 -3.324812 0.000929
H  -0.192319 -3.161621 -0.892896
H  -0.191736 -3.160781 0.895561
H  3.985963 0.641304 -0.893764
H  3.984674 0.64834 0.893932
H  3.408234 2.109015 -0.005683
H  -4.840457 -0.017677 -0.000667
H  -4.251382 -1.693166 0.000364
