program: Gaussian 09
title: 000228821
version: EM64L-G09RevD.01
frameworkgroup: C1[X(C12H17NO2)]
method: RPBEPBE
basis: SDD
operation: Freq
keyword: #p
keyword: freq=noraman
keyword: PBEPBE/SDD
title: #p freq=noraman PBEPBE/SDD
converged: YES YES NO NO
title: Mulliken charges:
elementType: O O N C C C C C C C C C C C C H H H H H H H H H H H H H H H H H
charge: -0.400359 -0.253671 -0.574348 0.237265 -0.610485 0.331027 0.329339 -0.193216 0.482524 -0.626510 -0.602546 -0.871564 -0.840872 0.198037 -0.816617 0.213162 0.241963 0.259650 0.233592 0.232388 0.226007 0.266784 0.230544 0.231844 0.240749 0.215449 0.273694 0.289579 0.232649 0.222950 0.223452 0.377543
chargesum: 0.00000
title: Mulliken charges with hydrogens summed into heavy atoms:
elementType: O O N C C C C C C C C C C C C
charge: -0.022817 -0.253671 -0.011076 0.237265 -0.155361 0.331027 0.329339 0.066434 0.482524 -0.392917 -0.370159 -0.148229 -0.152830 0.198037 -0.137566
polarizability: 1.73255041e+02 2.56428746e+00 1.48657885e+02 -2.17339631e+01 4.39758052e+00 1.04847585e+02
1716.lowfreq: -12.3825 0.0003 0.0005 0.0006 2.9334 9.4861 20.3757 22.8860 30.3142
frequency: 20.1366 22.8182 30.0565 47.6351 81.3986 111.4634 142.6315 183.1517 188.0340 215.1052 221.4205 230.2489 258.3003 271.3168 281.4431 323.1259 357.6548 374.5565 447.8900 492.7861 505.4144 524.2639 540.8104 560.6854 564.2463 570.9844 597.5283 621.5912 720.1277 724.5002 770.1493 791.1729 866.3634 894.2535 897.3354 954.8382 959.8142 977.5407 1017.2286 1017.7857 1038.2283 1039.9447 1046.1610 1050.8251 1061.5076 1101.9820 1146.3242 1150.2236 1193.5953 1217.9218 1261.1197 1267.0854 1293.7369 1313.9865 1321.5809 1367.2989 1395.4264 1396.6374 1402.2592 1406.0340 1416.6641 1445.5117 1461.6290 1472.9054 1475.1019 1477.5731 1480.7932 1489.7689 1500.4424 1588.5706 1613.2598 1620.8035 1666.2050 2971.5561 2971.8537 2972.6300 2982.9869 3048.2904 3052.4943 3052.6419 3057.5796 3076.4630 3080.3686 3081.5284 3083.3946 3108.7507 3113.2187 3464.1405 3497.9553 3600.4899
redmass: 1.7850 1.7025 5.3012 4.3003 2.8946 3.1561 1.4369 2.1233 1.1518 1.8360 2.8234 2.4884 3.1256 2.5047 2.3144 2.7498 2.8562 2.8955 4.1971 2.7573 3.0366 3.0588 3.8110 3.1914 2.2777 2.3950 3.0301 1.3695 4.3838 2.9189 3.0218 4.1018 1.3090 2.0572 1.4939 2.6302 2.8677 2.4700 1.6935 1.6045 1.6273 1.6408 1.5380 1.5926 2.8222 1.8495 1.7685 2.3064 1.4144 1.6745 1.5158 1.4998 1.4119 5.0718 1.2572 4.6636 1.2424 1.2475 1.3167 1.8204 2.3762 1.6075 1.2273 1.0536 1.0919 1.0588 1.1199 1.2267 1.2702 6.6461 1.3641 5.5220 3.4196 1.0381 1.0387 1.0386 1.0646 1.0965 1.0951 1.0951 1.0921 1.0949 1.0936 1.0997 1.0979 1.0908 1.0916 1.0446 1.0637 1.0986
irintensity: 0.7389 1.3020 2.5494 2.2002 0.0497 1.2008 2.1675 6.2319 0.7071 38.5172 3.9023 6.5877 11.9705 1.8172 16.2821 4.5017 0.4514 0.2813 17.2908 1.4001 25.3757 0.2959 1.5973 44.2014 34.9684 100.7150 12.9928 295.2860 26.3177 4.4523 2.7306 4.2023 16.8534 1.2239 0.4779 9.5139 8.9140 24.3944 7.4718 4.5948 6.4671 2.4050 1.2520 13.0619 221.8769 12.1804 5.2153 1.9605 8.9925 0.9356 2.8064 4.0259 3.1422 0.7325 6.3699 1.8474 13.1852 10.8032 16.8924 9.7660 1.7274 1.2904 3.6825 10.6193 5.1134 25.9515 20.2850 28.8342 21.3464 9.0257 130.5463 27.4560 103.6989 59.7701 49.0714 1.9113 37.7549 19.3551 7.3722 30.2975 4.1205 39.5530 14.0219 17.3099 11.3017 33.2638 16.8462 7.0918 17.8527 6.2849
temp: 298.150 k
press: 1.00000 atm
elementType: 8 8 7 6 6 6 6 6 6 6 6 6 6 6 6 1 1 1 1 1 1 1 1 1 1 1 1 1 1 1 1 1
symmnumber: 1
zpe: 698471.1 jmol-1
zpe.correction: 0.266034 hartree
zpe.thermalcorrener: 0.282841 hartree
zpe.thermalcorrenthalpy: 0.283785 hartree
zpe.thermalcorrgfe: 0.219658 hartree
zpe.sumelectzpe: -671.549076 hartree
zpe.sumelectthermal: -671.532268 hartree
zpe.sumelectthermalent: -671.531324 hartree
zpe.sumelectthermalfe: -671.595451 hartree
dipole: -1.1395 1.0068 -0.6926
dipole: 1.6709
quadrupole: -92.4261 -87.3026 -85.3647
quadrupole: 4.2092 -8.8026 -2.6021
quadrupole: -4.0616 1.0619 2.9997 4.2092 -8.8026 -2.6021
hfenergy: -671.8151092 hartree
pointgroup: C01 [X(C12H17N1O2)]
dipole: 0.4918624 -0.4004321 -0.1727829 debye
polarizability: 172.3373168|11.0402844|145.5345561|19.8383034|-12.9993329|108.8886376 unknown
InChI: InChI=1S/C12H17NO2/c1-7-4-8(2)10(9(3)5-7)6-11(13)12(14)15/h4-5,11,14H,6,13H2,1-3H3
charge 0 multiplicity 1
32 atoms
O  -1.604922 0.377126 2.194943
O  -2.878379 1.417676 0.557889
N  -3.602265 -1.276433 -0.160203
C  0.210625 -0.402255 -0.561566
C  -1.198642 -0.853287 -0.929487
C  0.663869 0.907918 -0.914515
C  1.096831 -1.281546 0.134258
C  -2.233181 -0.946639 0.263463
C  2.855497 0.458939 0.149732
C  1.971521 1.313014 -0.550548
C  2.399416 -0.840493 0.470556
C  -0.207544 1.880628 -1.699119
C  0.68638 -2.691264 0.535326
C  -2.295803 0.394357 0.986367
C  4.243613 0.925561 0.554171
H  -1.178061 -1.864144 -1.383823
H  -1.643794 -0.176169 -1.678966
H  -1.887415 -1.704361 0.983862
H  2.310366 2.319094 -0.829829
H  3.072642 -1.529692 0.997017
H  -0.448279 1.491122 -2.707553
H  -1.167107 2.088668 -1.192243
H  0.315288 2.842537 -1.83578
H  1.575145 -3.314278 0.735365
H  0.078396 -2.686906 1.460562
H  0.090914 -3.198194 -0.24628
H  -3.697491 -2.185069 -0.620551
H  -4.072668 -0.513238 -0.657313
H  4.235703 1.369463 1.569071
H  4.963668 0.088021 0.570068
H  4.62987 1.695601 -0.136875
H  -1.628093 1.285148 2.605401
