program: Gaussian 09
title: 000228819
version: EM64L-G09RevD.01
frameworkgroup: C1[X(C11H15NO2)]
method: RPBEPBE
basis: SDD
operation: Freq
keyword: #p
keyword: freq=noraman
keyword: PBEPBE/SDD
title: #p freq=noraman PBEPBE/SDD
converged: YES YES NO NO
title: Mulliken charges:
elementType: O O N C C C C C C C C C C C H H H H H H H H H H H H H H H
charge: -0.399971 -0.246423 -0.569613 -0.597594 0.405467 -0.197503 0.297429 -0.613352 0.453907 -0.408588 -0.378216 -0.836269 0.195002 -0.817042 0.207789 0.231003 0.256270 0.250921 0.225363 0.228416 0.229634 0.226358 0.232803 0.273084 0.290459 0.231630 0.227194 0.225097 0.376741
chargesum: 0.00000
title: Mulliken charges with hydrogens summed into heavy atoms:
elementType: O O N C C C C C C C C C C C
charge: -0.023230 -0.246423 -0.006069 -0.158801 0.405467 0.058767 0.297429 -0.362431 0.453907 -0.183225 -0.149800 -0.147475 0.195002 -0.133120
polarizability: 1.53382558e+02 1.20326129e+01 1.42317890e+02 -1.80046326e+01 9.45899633e+00 9.49382479e+01
1716.lowfreq: -17.3336 -3.1667 -0.0009 -0.0009 0.0008 8.7114 12.9510 31.5406 42.1426
frequency: -13.7291 31.4540 42.1354 47.8470 86.7473 106.1147 140.2104 164.2870 222.3525 250.8973 271.5144 282.3328 300.3249 327.4971 328.8309 431.8085 451.9285 458.5364 465.4269 547.5834 564.5156 597.7610 614.0990 631.8363 711.2155 719.1955 741.5989 755.8472 775.5943 821.4393 901.9691 922.9028 945.9278 956.2272 975.2132 997.5840 1010.4125 1041.3299 1047.9943 1061.0359 1097.1422 1112.5470 1150.0103 1170.5189 1189.1367 1223.8484 1257.2211 1264.6924 1286.8465 1301.5918 1324.9600 1370.9474 1396.8884 1397.7131 1404.6358 1411.0201 1460.0095 1471.1187 1473.7644 1473.8997 1482.6436 1503.2510 1584.8014 1614.3527 1625.2502 1668.1054 2969.3145 2974.7171 2989.1387 3043.1817 3045.3313 3052.7415 3064.0121 3080.7678 3082.4470 3108.1758 3110.5403 3135.9111 3465.2233 3497.1241 3601.4659
redmass: 1.0304 4.5743 7.6777 4.9156 3.8622 1.3349 1.8745 4.2902 1.6309 2.9728 2.9092 2.2189 2.8626 2.6665 2.9062 3.4089 2.9355 3.3581 3.2599 2.2412 1.8033 3.1215 2.4152 1.9068 3.8659 3.8272 4.1782 3.8128 3.1514 1.2933 1.4230 2.5612 1.7244 1.4489 3.3293 1.7418 1.5174 1.5664 1.5489 2.7756 1.6406 2.2422 1.4944 1.5420 1.4156 1.9145 3.2692 1.7624 1.3087 1.3910 1.2191 5.3966 1.2610 1.2368 2.3280 2.1631 1.1111 1.0524 1.0582 1.0915 1.1195 2.9289 6.0151 1.3290 6.3259 3.5525 1.0381 1.0375 1.0593 1.0965 1.0972 1.0970 1.0925 1.0977 1.0989 1.0911 1.0868 1.0969 1.0445 1.0637 1.0987
irintensity: 0.3468 0.2228 4.9112 0.3592 1.0860 1.4602 0.2130 2.6440 45.5167 6.8792 4.5046 22.7538 3.2169 0.1303 1.4211 3.3192 9.9431 8.9596 12.1751 110.3081 53.6686 12.5260 216.1070 111.5656 1.3531 39.7000 2.8779 1.5667 1.6439 30.0433 1.3241 0.3838 11.1832 0.1840 30.9836 12.9000 6.2102 0.9601 13.5158 226.5200 8.1723 5.2222 6.9375 3.2897 8.3409 0.1646 0.3496 6.8429 1.4572 1.2891 5.4279 1.2175 3.7836 16.8095 10.7170 6.0870 7.7005 11.1913 15.3185 9.7653 26.2723 29.6129 4.2549 141.1400 6.9673 108.0575 40.2099 37.2384 34.4002 21.2273 5.5315 22.1614 29.6901 19.9846 18.6952 16.3096 14.6052 30.1403 7.6938 17.0725 6.4347
temp: 298.150 k
press: 1.00000 atm
elementType: 8 8 7 6 6 6 6 6 6 6 6 6 6 6 1 1 1 1 1 1 1 1 1 1 1 1 1 1 1
symmnumber: 1
zpe: 626176.5 jmol-1
zpe.correction: 0.238498 hartree
zpe.thermalcorrener: 0.252859 hartree
zpe.thermalcorrenthalpy: 0.253803 hartree
zpe.thermalcorrgfe: 0.196266 hartree
zpe.sumelectzpe: -632.323047 hartree
zpe.sumelectthermal: -632.308686 hartree
zpe.sumelectthermalent: -632.307742 hartree
zpe.sumelectthermalfe: -632.365279 hartree
dipole: -1.1156 1.3508 -0.2866
dipole: 1.7752
quadrupole: -84.7869 -78.0430 -82.2652
quadrupole: 7.5965 -5.9857 -3.8996
quadrupole: -3.0885 3.6553 -0.5668 7.5965 -5.9857 -3.8996
hfenergy: -632.561545 hartree
pointgroup: C01 [X(C11H15N1O2)]
dipole: -0.4961115 -0.484452 0.0833447 debye
polarizability: 150.9219438|-14.2070126|143.8611897|17.2896729|11.1220591|95.8555631 unknown
InChI: InChI=1S/C11H15NO2/c1-7-3-4-8(2)9(5-7)6-10(12)11(13)14/h3-5,10,13H,6,12H2,1-2H3
charge 0 multiplicity 1
29 atoms
O  1.661388 0.975958 -1.834117
O  2.616707 1.759636 0.130831
N  3.547013 -0.967531 0.365132
C  1.060593 -0.857317 0.962155
C  -0.348119 -0.533213 0.488852
C  2.194872 -0.657113 -0.121499
C  -1.135562 -1.48568 -0.225392
C  -0.881473 0.756664 0.743758
C  -2.171857 1.144028 0.310292
C  -2.428299 -1.098172 -0.65843
C  -2.941829 0.19055 -0.402016
C  -0.629849 -2.890497 -0.514783
C  2.200797 0.803197 -0.562854
C  -2.723875 2.527048 0.613039
H  1.136367 -1.912056 1.289427
H  1.331722 -0.222314 1.826934
H  1.971597 -1.281145 -1.002689
H  -0.267905 1.477756 1.300531
H  -3.042973 -1.82249 -1.207219
H  -3.946936 0.456101 -0.752961
H  0.291466 -2.883004 -1.12729
H  -0.39613 -3.44323 0.415984
H  -1.387128 -3.473893 -1.065696
H  3.685492 -1.940712 0.648292
H  3.905044 -0.287408 1.043329
H  -3.553812 2.476927 1.343909
H  -1.948087 3.18859 1.035708
H  -3.123449 3.010862 -0.29756
H  1.636125 1.947459 -2.055668
