program: Gaussian 09
title: 000228818
version: EM64L-G09RevD.01
frameworkgroup: C1[X(C11H15NO2)]
method: RPBEPBE
basis: SDD
operation: Freq
keyword: #p
keyword: freq=noraman
keyword: PBEPBE/SDD
title: #p freq=noraman PBEPBE/SDD
converged: YES YES NO NO
title: Mulliken charges:
elementType: O O N C C C C C C C C C C C H H H H H H H H H H H H H H H
charge: -0.400726 -0.253325 -0.574016 -0.606072 0.232875 -0.195860 0.317518 0.317539 -0.434589 -0.418061 -0.864733 -0.833425 -0.239064 0.200612 0.213444 0.241418 0.259568 0.229912 0.228196 0.225912 0.269030 0.228765 0.231041 0.241185 0.216221 0.224000 0.274897 0.289525 0.378211
chargesum: 0.00000
title: Mulliken charges with hydrogens summed into heavy atoms:
elementType: O O N C C C C C C C C C C C
charge: -0.022514 -0.253325 -0.009594 -0.151209 0.232875 0.063707 0.317518 0.317539 -0.204677 -0.189865 -0.141025 -0.144978 -0.015064 0.200612
polarizability: 1.46341197e+02 1.24721222e+00 1.41366949e+02 -2.24859763e+01 2.57089677e+00 9.76674483e+01
1716.lowfreq: -12.8672 -10.5543 -5.7931 0.0004 0.0005 0.0007 26.8669 37.3844 57.1161
frequency: 26.4940 37.0982 57.0527 83.8404 116.3952 152.7860 171.5644 209.7258 221.3210 229.0878 258.7320 284.8768 311.1477 341.5000 361.5865 443.8518 454.1417 505.2933 523.8395 530.0981 537.4826 561.1252 595.3452 628.9169 676.8926 721.6844 737.8320 773.4133 779.2873 827.6700 877.0330 900.4277 954.8449 974.0360 978.9044 989.0142 1036.3701 1041.2918 1047.8224 1061.2983 1096.9087 1102.3500 1145.2400 1177.3528 1188.1802 1193.2166 1259.6928 1261.1332 1264.2807 1292.7862 1320.4119 1367.9374 1396.1639 1402.7562 1407.3751 1436.2326 1452.8830 1459.6128 1476.7841 1479.7244 1485.4302 1494.1135 1594.7322 1603.8618 1614.1878 1666.7761 2972.3044 2973.0730 2984.3902 3049.3111 3052.0296 3059.2991 3077.2410 3081.2371 3083.5338 3115.4188 3125.0365 3152.6012 3467.3194 3497.9483 3604.2315
redmass: 5.9583 5.6113 4.3667 2.8622 2.8527 1.4034 1.0481 3.1594 2.1159 1.9839 3.1260 2.1121 3.1763 3.0618 2.1970 4.1729 2.5344 2.9464 3.0036 4.9664 3.4191 1.7280 2.9510 1.3563 4.0707 4.1955 3.0646 3.4758 1.2526 4.2447 2.7192 1.3114 1.9816 1.6777 2.1187 1.6012 1.7432 1.6063 1.5407 2.8148 1.8279 1.8120 1.5156 1.2065 1.8623 2.1487 1.8551 2.3963 1.6043 1.3987 1.2378 4.6325 1.2593 1.3157 1.6742 2.1681 2.0178 1.1910 1.0552 1.1280 1.1749 1.1197 7.0097 5.4798 1.3433 3.5125 1.0386 1.0381 1.0645 1.0964 1.0956 1.0924 1.0965 1.0942 1.0958 1.0855 1.0915 1.0995 1.0445 1.0637 1.0988
irintensity: 1.3145 3.6104 1.5339 0.0320 1.7281 0.8475 0.6659 13.3393 15.4048 24.3369 12.3569 21.0887 2.3736 6.0178 1.1890 18.1489 2.1848 23.4343 0.9744 1.4062 1.6276 199.2925 9.8464 259.8729 0.0214 34.1969 1.2082 2.3566 52.0795 2.0998 0.1777 0.0020 14.8921 12.3342 23.9382 2.9832 9.4167 3.0762 4.3943 213.0319 22.6149 9.3326 4.5606 1.6367 4.7588 3.9258 1.0487 2.2208 4.0124 3.9061 7.0603 2.5408 12.8453 19.1958 10.9435 0.3632 2.0846 7.5410 23.3739 14.2531 28.5173 15.5862 5.8666 1.8823 135.9352 104.7602 45.9943 17.4690 35.5716 20.3372 11.8117 4.4610 38.4953 21.1902 6.9174 0.8077 30.7025 36.1983 7.1024 18.6752 6.6027
temp: 298.150 k
press: 1.00000 atm
elementType: 8 8 7 6 6 6 6 6 6 6 6 6 6 6 1 1 1 1 1 1 1 1 1 1 1 1 1 1 1
symmnumber: 1
zpe: 627777.6 jmol-1
zpe.correction: 0.239108 hartree
zpe.thermalcorrener: 0.253932 hartree
zpe.thermalcorrenthalpy: 0.254876 hartree
zpe.thermalcorrgfe: 0.196598 hartree
zpe.sumelectzpe: -632.319783 hartree
zpe.sumelectthermal: -632.304959 hartree
zpe.sumelectthermalent: -632.304015 hartree
zpe.sumelectthermalfe: -632.362293 hartree
dipole: -0.7947 1.0432 -0.8432
dipole: 1.5591
quadrupole: -88.5126 -80.2260 -77.6692
quadrupole: 2.9058 -7.2542 -3.0584
quadrupole: -6.3767 1.9099 4.4667 2.9058 -7.2542 -3.0584
hfenergy: -632.5588914 hartree
pointgroup: C01 [X(C11H15N1O2)]
dipole: 0.374697 -0.4248259 -0.2353547 debye
polarizability: 146.2942813|7.596202|139.6569366|20.7708787|-9.9325813|99.4243763 unknown
InChI: InChI=1S/C11H15NO2/c1-7-4-3-5-8(2)9(7)6-10(12)11(13)14/h3-5,10,13H,6,12H2,1-2H3
charge 0 multiplicity 1
29 atoms
O  -1.446405 0.140036 2.201592
O  -2.736141 1.136331 0.549391
N  -3.105616 -1.585296 -0.341927
C  -0.742979 -0.8332 -0.973885
C  0.5811 -0.233331 -0.512956
C  -1.805778 -1.11786 0.161298
C  0.872016 1.144851 -0.770888
C  1.537414 -1.040646 0.179654
C  2.097095 1.692419 -0.313945
C  2.755621 -0.461158 0.613145
C  -0.082934 2.043252 -1.547287
C  1.291392 -2.512917 0.477086
C  3.03632 0.900171 0.378359
C  -2.063619 0.159722 0.953928
H  -0.576433 -1.807274 -1.475443
H  -1.235797 -0.175393 -1.710342
H  -1.400769 -1.868615 0.857409
H  2.31557 2.748428 -0.512878
H  3.486802 -1.086979 1.139089
H  -0.235334 1.678856 -2.581913
H  -1.079733 2.109188 -1.07481
H  0.323971 3.06647 -1.617177
H  2.241825 -3.0285 0.698105
H  0.637904 -2.64414 1.361021
H  0.812176 -3.041964 -0.367197
H  3.981201 1.336643 0.721282
H  -3.076863 -2.482513 -0.832015
H  -3.641136 -0.863505 -0.834416
H  -1.597573 1.010229 2.663523
