program: Gaussian 09
title: 000228817
version: EM64L-G09RevD.01
frameworkgroup: C1[X(C11H15NO2)]
method: RPBEPBE
basis: SDD
operation: Freq
keyword: #p
keyword: freq=noraman
keyword: PBEPBE/SDD
title: #p freq=noraman PBEPBE/SDD
converged: NO YES NO NO
title: Mulliken charges:
elementType: O O N C C C C C C C C C C C H H H H H H H H H H H H H H H
charge: -0.400933 -0.245989 -0.569079 -0.592478 0.394195 -0.198588 0.309340 -0.405165 -0.551858 0.460255 -0.451652 -0.842444 0.195080 -0.812219 0.230313 0.207623 0.255994 0.245648 0.229984 0.230313 0.233907 0.227457 0.229399 0.289899 0.273298 0.228397 0.229540 0.223014 0.376749
chargesum: 0.00000
title: Mulliken charges with hydrogens summed into heavy atoms:
elementType: O O N C C C C C C C C C C C
charge: -0.024184 -0.245989 -0.005883 -0.154542 0.394195 0.057406 0.309340 -0.159516 -0.321874 0.460255 -0.221339 -0.151682 0.195080 -0.131268
polarizability: 1.64049953e+02 -1.22996914e+01 1.33000228e+02 1.72527727e+01 1.09856643e+01 9.51944528e+01
1716.lowfreq: -5.7963 -0.0006 -0.0004 0.0005 1.8738 13.9508 34.2035 40.5216 46.4878
frequency: 34.0061 40.1227 46.4310 50.7564 77.1424 117.5095 132.8598 203.0236 212.7135 223.2169 261.3538 278.1839 286.2137 331.8716 354.8248 430.7081 450.1271 456.7854 510.2168 545.8815 562.5470 571.0721 596.1598 627.3540 713.7841 720.3018 732.3233 768.8240 784.0213 832.3451 888.9120 919.5376 948.3281 960.6046 977.7819 980.4545 1018.8088 1041.5815 1049.2218 1060.0273 1095.3823 1110.8330 1146.6434 1168.5744 1188.5108 1217.4990 1258.0300 1266.0762 1286.8079 1298.0663 1320.5104 1372.1754 1396.0657 1398.2913 1406.2388 1407.1744 1461.9976 1470.2584 1473.3534 1475.3308 1478.5265 1502.8338 1585.3413 1615.0557 1624.5595 1669.1366 2970.7070 2974.2192 2987.6673 3044.8574 3045.4913 3051.8701 3068.1970 3081.7347 3081.8812 3105.0193 3109.6685 3135.1909 3464.4702 3497.1708 3600.6204
redmass: 3.8679 1.1204 7.4227 4.2805 3.5482 1.1438 3.3597 2.6009 2.6085 1.8509 3.0928 2.3704 2.7477 2.2702 4.0482 3.1574 2.6502 3.2764 3.0153 4.3537 2.6539 1.8232 2.8935 1.3735 4.9755 3.8193 3.8032 2.9380 3.0816 1.4531 1.2981 2.6426 1.9802 1.6256 2.6212 1.7488 1.4875 1.5452 1.5815 2.7562 1.5549 2.1109 1.7050 1.5540 1.3736 1.8440 2.3202 2.0588 1.4166 1.3601 1.2191 5.1878 1.2908 1.2556 2.5106 1.9228 1.1276 1.0464 1.0516 1.1573 1.1781 2.3438 6.1414 1.3234 6.2589 3.6167 1.0380 1.0372 1.0593 1.0974 1.0984 1.0976 1.0899 1.0984 1.0980 1.0910 1.0873 1.0968 1.0445 1.0637 1.0987
irintensity: 0.1874 0.3207 5.5658 0.2809 1.3005 0.6016 1.0309 4.2979 22.3539 29.4342 8.3515 15.9758 5.5332 0.2223 1.3909 1.5943 4.4445 19.6533 24.2519 4.1230 17.5695 173.2775 16.7582 285.4701 1.5380 32.2743 3.2184 1.6766 0.9779 25.7554 2.4170 4.6621 10.1467 1.2760 23.9418 20.6666 2.3682 0.3469 10.3133 228.8327 7.7985 6.5346 5.7369 5.2043 7.9263 0.7266 2.1656 4.7182 2.0715 0.9379 5.1242 1.4264 12.6829 10.9156 1.7895 12.9664 9.5926 15.8004 15.3500 3.6887 22.3605 33.7144 1.0591 136.9481 11.1383 112.7798 36.8458 39.4208 35.9859 19.8381 7.8040 22.8679 27.7173 13.0990 24.2708 29.9688 12.1315 19.9469 7.8031 17.1811 6.2775
temp: 298.150 k
press: 1.00000 atm
elementType: 8 8 7 6 6 6 6 6 6 6 6 6 6 6 1 1 1 1 1 1 1 1 1 1 1 1 1 1 1
symmnumber: 1
zpe: 626304.7 jmol-1
zpe.correction: 0.238547 hartree
zpe.thermalcorrener: 0.253744 hartree
zpe.thermalcorrenthalpy: 0.254689 hartree
zpe.thermalcorrgfe: 0.194846 hartree
zpe.sumelectzpe: -632.323021 hartree
zpe.sumelectthermal: -632.307824 hartree
zpe.sumelectthermalent: -632.306879 hartree
zpe.sumelectthermalfe: -632.366722 hartree
dipole: 1.4480 1.5437 0.0546
dipole: 2.1173
quadrupole: -84.7004 -75.9480 -84.5379
quadrupole: -7.1707 5.1539 -3.4862
quadrupole: -2.9716 5.7808 -2.8092 -7.1707 5.1539 -3.4862
hfenergy: -632.5615681 hartree
pointgroup: C01 [X(C11H15N1O2)]
dipole: 0.6175765 0.5561148 0.0567145 debye
polarizability: 162.0623527|-15.8087518|133.6686705|16.6046634|12.3495478|96.5136099 unknown
InChI: InChI=1S/C11H15NO2/c1-7-3-4-9(8(2)5-7)6-10(12)11(13)14/h3-5,10,13H,6,12H2,1-2H3
charge 0 multiplicity 1
29 atoms
O  -1.737235 -1.20699 1.697708
O  -2.876879 -1.586201 -0.28926
N  -3.549647 1.218706 -0.018185
C  -1.139889 0.979298 -0.848609
C  0.258568 0.456161 -0.558967
C  -2.203354 0.714507 0.290749
C  1.203255 1.208665 0.205915
C  0.636163 -0.823182 -1.036259
C  2.477756 0.649378 0.461506
C  2.857026 -0.634028 -0.010122
C  1.912176 -1.365412 -0.768739
C  0.873347 2.597222 0.732095
C  -2.328601 -0.790859 0.507631
C  4.236146 -1.195726 0.292398
H  -1.538909 0.515003 -1.770542
H  -1.130848 2.074694 -1.007972
H  -1.85182 1.168177 1.231987
H  -0.083171 -1.400955 -1.630733
H  3.201638 1.232781 1.046514
H  2.176007 -2.357171 -1.155624
H  1.720932 3.013505 1.302725
H  0.646256 3.30352 -0.090091
H  -0.005883 2.58804 1.403548
H  -4.020801 0.699503 -0.766027
H  -3.610933 2.234491 -0.123134
H  5.035279 -0.526409 -0.078459
H  4.392258 -1.314453 1.381569
H  4.380303 -2.184338 -0.176741
H  -1.798843 -2.19923 1.770422
