program: Gaussian 09
title: 000228816
version: EM64L-G09RevD.01
frameworkgroup: C1[X(C9H12N2O2)]
method: RPBEPBE
basis: SDD
operation: Freq
keyword: #p
keyword: freq=noraman
keyword: PBEPBE/SDD
title: #p freq=noraman PBEPBE/SDD
converged: YES YES NO NO
title: Mulliken charges:
elementType: O O N N C C C C C C C C C H H H H H H H H H H H H
charge: -0.399793 -0.257801 -0.573086 -0.708457 -0.595390 -0.203312 0.563348 -0.594759 -0.467840 0.498872 0.218380 -0.192933 -0.433628 0.211850 0.221079 0.264227 0.242068 0.226668 0.281281 0.284737 0.215217 0.215236 0.302943 0.307662 0.373431
chargesum: 0.00000
title: Mulliken charges with hydrogens summed into heavy atoms:
elementType: O O N N C C C C C C C C C
charge: -0.026362 -0.257801 -0.007067 -0.097852 -0.162460 0.060915 0.563348 -0.352692 -0.241172 0.498872 0.218380 0.022284 -0.218392
polarizability: 1.39632703e+02 1.50585565e+01 1.25089975e+02 1.57559247e+01 -1.28126745e+01 8.52304124e+01
1716.lowfreq: -11.5033 -1.7002 0.0002 0.0005 0.0008 6.0562 22.4374 34.8410 52.0001
frequency: 22.2666 34.7683 51.9681 80.5836 165.9687 200.5428 215.9616 253.1363 265.3489 288.1189 317.3492 347.7079 382.3036 412.4712 434.9105 461.7787 516.6647 528.1468 571.3487 592.8050 610.4750 637.7742 699.8330 723.8416 753.0944 765.6021 793.7223 865.2268 881.9279 920.5032 960.2795 961.2225 981.6462 1001.3608 1034.5229 1068.4735 1087.7824 1100.0035 1129.3784 1177.6689 1183.5175 1190.5189 1257.7523 1292.0170 1315.5765 1323.5762 1330.8501 1392.4363 1401.2423 1459.2782 1466.6248 1493.5243 1595.2414 1615.3772 1626.7132 1641.3886 1664.9572 2989.1531 3047.3617 3070.7983 3112.6835 3115.6072 3126.0251 3150.3485 3483.3057 3494.9218 3569.1483 3621.8711 3710.3608
redmass: 4.7636 5.8556 6.3826 3.8498 4.8871 1.4834 3.4867 2.4873 3.2067 3.2611 2.7960 1.2263 1.0488 2.5198 3.3031 2.7245 1.8627 4.0915 3.5088 3.1529 2.2959 1.9414 1.8916 4.4044 3.3314 3.1350 1.8901 1.4473 1.5952 2.0819 1.9913 1.3320 5.6162 5.3477 1.5941 2.5261 1.6653 1.6656 1.5184 1.1019 1.3638 1.6498 1.5599 1.3716 1.4606 1.2952 2.2024 6.0699 1.9267 1.1719 2.8349 2.8404 6.1256 1.3201 3.7140 1.3240 3.6599 1.0591 1.0998 1.0905 1.0881 1.0886 1.0914 1.0994 1.0443 1.0636 1.0448 1.0996 1.1040
irintensity: 6.1512 1.6574 3.5273 2.9604 1.6872 49.3871 5.4697 34.1031 5.0331 3.5249 5.4359 272.9129 25.3075 0.0264 12.4042 18.9316 167.2850 50.6833 42.9669 30.9673 86.0442 107.8485 51.1868 27.2105 14.9756 1.1496 31.6842 0.8832 19.9679 5.3483 3.6366 0.1686 6.3339 102.9876 11.7824 179.2497 27.1892 7.7463 3.7849 8.2676 2.8449 10.5904 8.5343 10.6984 3.6148 12.6816 23.2227 12.1016 16.0930 13.3074 21.1907 44.6945 30.2090 114.0385 77.3343 259.8768 107.8017 34.8550 7.7489 16.8585 2.8811 15.0019 29.3661 26.5891 7.0402 14.6676 58.0835 7.5450 19.2131
temp: 298.150 k
press: 1.00000 atm
elementType: 8 8 7 7 6 6 6 6 6 6 6 6 6 1 1 1 1 1 1 1 1 1 1 1 1
symmnumber: 1
zpe: 526600.1 jmol-1
zpe.correction: 0.200571 hartree
zpe.thermalcorrener: 0.213931 hartree
zpe.thermalcorrenthalpy: 0.214875 hartree
zpe.thermalcorrgfe: 0.159380 hartree
zpe.sumelectzpe: -609.143537 hartree
zpe.sumelectthermal: -609.130177 hartree
zpe.sumelectthermalent: -609.129233 hartree
zpe.sumelectthermalfe: -609.184729 hartree
dipole: 1.4698 0.1820 -0.1727
dipole: 1.4911
quadrupole: -69.5612 -66.0604 -78.0858
quadrupole: 12.9375 4.2914 1.7842
quadrupole: 1.6746 5.1754 -6.8500 12.9375 4.2914 1.7842
hfenergy: -609.3441083 hartree
pointgroup: C01 [X(C9H12N2O2)]
dipole: 0.5692354 -0.1019678 0.0985859 debye
dipolederiv: -0.4092221 0.0256609 0.1024387 -0.0204046 -0.269207 -0.326656 0.0126978 -0.2178329 -1.0875443 -0.4118689 -0.0509917 0.1094256 -0.142072 -0.7003343 0.2615582 0.0298668 0.012127 -0.7780625 -1.1015549 0.0269305 -0.185448 -0.0336577 -0.3776192 -0.1894335 -0.2517408 -0.1286821 -0.4243532 -0.4570131 0.3856575 -0.3345364 0.4990777 -1.2540757 0.0859878 -0.362025 0.0849411 -0.6435169 -0.2634948 0.0580597 -0.0167906 -0.0784782 0.0997947 -0.0490728 -0.2308213 0.0279521 0.0856901 0.7759335 -0.025544 0.0799974 -0.0854083 0.1247144 0.0411313 0.1589479 0.0485818 0.2038563 0.361986 -0.0728012 -0.0456539 -0.0035002 0.2188634 -0.1525069 -0.2108964 -0.1089706 0.0121761 -0.3230752 0.3761273 -0.1970804 0.0676072 -0.2764973 0.0187601 -0.0079513 -0.1334485 -0.1611209 -0.4169865 -0.0340583 0.0330635 -0.0535441 -0.146062 -0.0126432 0.1045171 -0.0317631 -0.2394515 0.3524971 -0.5192331 0.1987774 -0.650687 1.229184 -0.3060964 0.2294957 -0.292584 0.2132004 0.3058116 -0.0546785 -0.248962 0.2197396 0.9138898 0.0460366 -0.1032612 0.1506191 1.445543 0.255585 -0.0479429 -0.1110928 -0.1916799 0.1661795 -0.0605734 -0.0622424 -0.1089726 -0.0324716 -0.012943 -0.1776824 -0.0384671 0.2397126 -0.399739 -0.0072838 -0.2208109 0.1426212 -0.2315009 0.0088945 0.0053141 0.008898 0.067766 -0.1489177 -0.0612746 0.0050526 -0.0234219 0.0601533 0.0006857 0.0040293 0.0511826 -0.0272472 0.0438856 0.1138293 0.0672562 0.0332783 -0.0636809 0.0401901 -0.0203357 0.0368711 -0.0233389 0.0271588 0.0608651 0.0273739 0.0449807 -0.0487288 0.0607888 -0.0421166 0.0847891 -0.0469308 -0.0032444 0.0860558 0.0826636 0.0876922 0.0854156 0.0513162 0.1118548 0.0048527 0.089681 -0.0640848 0.0661396 0.0094915 0.0585791 0.123505 0.2804494 -0.0278037 0.0851149 0.0589249 0.0292535 0.0305716 0.1891024 -0.0674628 0.2574851 0.2865094 0.0689364 0.0113982 0.1104842 0.2062399 0.0833865 0.131359 0.0798337 0.0957859 0.0132541 -0.0748994 0.0836771 -0.0799178 -0.0019884 0.0988202 0.0936604 0.1007927 0.0642453 -0.1157398 0.0686977 0.081715 0.0946733 0.0652937 0.0129989 0.0784369 0.0214766 0.130956 0.1722552 -0.003012 0.0911726 0.0007144 0.217996 0.0774292 0.0874236 0.0816485 0.306362 0.1525914 0.0156262 0.0911472 0.0034772 0.230847 0.0639117 0.0998616 0.0583306 0.311053 0.3931501 0.0042053 0.0235103 -0.0149913 0.0684696 0.0180588 0.0425423 0.079684 0.3150042 unknown
polarizability: 138.9005351|-16.341937|125.137515|-13.246393|-15.2997133|85.9150398 unknown
InChI: InChI=1S/C9H12N2O2/c10-7-3-1-2-6(4-7)5-8(11)9(12)13/h1-4,8,12H,5,10-11H2
charge 0 multiplicity 1
25 atoms
O  -1.843692 -1.153453 -1.790263
O  -2.288486 -1.652016 0.431134
N  -3.499725 1.060788 0.099752
N  2.838332 -2.015252 0.705312
C  -1.04362 1.122322 0.81565
C  -2.114365 0.715096 -0.258144
C  0.387151 0.801801 0.409645
C  0.962375 -0.441526 0.758922
C  1.143293 1.729389 -0.354331
C  2.2844 -0.782009 0.352801
C  -2.091764 -0.800227 -0.466723
C  2.45648 1.398057 -0.757846
C  3.031319 0.158243 -0.414607
H  -1.163422 2.21007 0.981491
H  -1.311184 0.606864 1.7581
H  -1.869705 1.195558 -1.219923
H  0.37962 -1.156522 1.354745
H  0.711258 2.701033 -0.621022
H  -3.746907 2.045683 -0.009672
H  -3.830148 0.640478 0.972456
H  3.043556 2.115371 -1.343431
H  4.052925 -0.084752 -0.732177
H  3.784096 -2.258912 0.428235
H  2.307438 -2.686235 1.252081
H  -1.850025 -2.146652 -1.874787
