program: Gaussian 09
title: 000228815
version: EM64L-G09RevD.01
frameworkgroup: C1[X(C9H10N2O4)]
method: RPBEPBE
basis: SDD
operation: Freq
keyword: #p
keyword: freq=noraman
keyword: PBEPBE/SDD
title: #p freq=noraman PBEPBE/SDD
converged: YES YES NO NO
title: Mulliken charges:
elementType: O O O O N N C C C C C C C C C H H H H H H H H H H
charge: -0.426473 -0.239442 -0.197447 -0.213378 -0.631592 0.009539 -0.569133 -0.117641 0.401534 0.174591 -0.350946 0.186718 -0.351113 -0.233057 -0.217690 0.251622 0.241532 0.254773 0.281424 0.279719 0.300236 0.299345 0.239650 0.242759 0.384470
chargesum: 0.00000
title: Mulliken charges with hydrogens summed into heavy atoms:
elementType: O O O O N N C C C C C C C C C
charge: -0.042003 -0.239442 -0.197447 -0.213378 -0.032011 0.009539 -0.075979 0.137132 0.401534 0.174591 -0.069522 0.186718 -0.071395 0.006593 0.025069
polarizability: 1.54273949e+02 -6.52480030e+00 1.50640967e+02 9.52519967e+00 1.59149809e+00 7.09183337e+01
1716.lowfreq: -9.7142 -5.4325 -0.8799 0.0004 0.0004 0.0006 35.1401 44.5039 64.4177
frequency: 35.0921 44.4929 64.3966 76.9885 92.6068 140.5299 184.0537 250.4279 267.8433 289.5616 302.6566 339.8668 378.7944 402.5271 428.7262 446.2899 528.1558 528.6676 537.0858 590.2381 612.3542 648.9014 673.5926 684.2168 712.6400 740.3471 761.8904 786.1447 807.2325 842.1929 893.5935 927.6188 972.7285 995.0799 1001.5045 1038.0438 1051.5449 1064.6180 1107.2831 1139.3386 1174.4702 1185.3978 1206.5310 1208.5186 1216.8347 1266.8612 1281.6456 1295.4489 1330.2994 1357.3120 1371.8326 1390.9405 1434.7852 1462.2170 1473.1455 1576.9679 1609.3122 1635.3019 1662.3371 2866.5872 3034.2498 3097.1815 3141.9431 3158.7313 3170.7015 3184.0248 3449.6698 3516.3285 3578.3543
redmass: 6.9355 8.9784 6.6404 7.4420 5.2859 5.4200 7.5164 5.8326 5.2796 2.6925 2.0568 2.1228 3.2349 4.0400 3.1195 4.4448 4.5087 3.8368 3.8364 2.7049 1.7918 6.3910 5.4078 2.1435 2.0447 2.7232 5.8550 1.6065 3.4736 3.2800 1.4858 2.0232 1.4286 3.2356 1.4584 2.7934 2.3885 2.8787 2.3012 1.9213 1.1055 1.1221 2.0460 1.7413 6.3661 1.7203 1.2348 1.4493 1.3909 6.3048 2.2946 4.8800 2.3282 1.1539 2.3545 6.3713 6.6221 1.0905 9.2041 1.0788 1.0602 1.1026 1.0869 1.0911 1.0960 1.0981 1.0450 1.0641 1.0975
irintensity: 1.0252 1.6964 4.3167 2.9614 1.2183 0.2593 0.4251 0.1783 3.1798 7.1116 12.6855 30.2026 1.1470 14.6556 1.2172 13.3798 22.4789 14.2500 25.6250 30.3556 14.1832 12.7415 20.7045 241.3572 116.1940 9.9064 10.9611 51.1300 13.2922 8.7629 0.9360 2.2062 1.0725 46.6578 15.7138 30.1029 287.8500 6.1191 4.6900 7.1384 9.7556 3.0575 40.1082 36.5831 177.0787 31.0310 1.3515 3.9904 11.9073 172.3601 7.8382 4.2572 10.3491 19.8466 37.2419 14.1598 10.4018 69.0645 172.2813 56.4437 10.7427 7.5451 3.8157 8.2434 5.8188 8.1062 3.0943 29.1423 8.5883
temp: 298.150 k
press: 1.00000 atm
elementType: 8 8 8 8 7 7 6 6 6 6 6 6 6 6 6 1 1 1 1 1 1 1 1 1 1
symmnumber: 1
zpe: 488840.8 jmol-1
zpe.correction: 0.186190 hartree
zpe.thermalcorrener: 0.200036 hartree
zpe.thermalcorrenthalpy: 0.200981 hartree
zpe.thermalcorrgfe: 0.144322 hartree
zpe.sumelectzpe: -758.166724 hartree
zpe.sumelectthermal: -758.152877 hartree
zpe.sumelectthermalent: -758.151933 hartree
zpe.sumelectthermalfe: -758.208591 hartree
dipole: 0.6101 3.2688 -1.3449
dipole: 3.5869
quadrupole: -78.6578 -89.8258 -87.2198
quadrupole: -10.0372 -3.4177 -1.4677
quadrupole: 6.5767 -4.5914 -1.9853 -10.0372 -3.4177 -1.4677
hfenergy: -758.3529134 hartree
pointgroup: C01 [X(C9H10N2O4)]
dipole: -0.2070442 -1.3210613 -0.4510152 debye
dipolederiv: -0.9969903 0.2235848 -0.4212193 0.1361113 -0.2869544 0.0487523 -0.5242859 0.1344311 -0.766228 -0.6245816 -0.1274787 -0.1097937 0.0834302 -0.8098054 0.2750786 -0.2698041 0.1261661 -0.4958004 -0.8047207 -0.2660757 -0.0600915 -0.2680526 -0.6366198 0.0265777 -0.0341301 0.06141 -0.2352684 -0.7596436 0.1579526 -0.107177 0.2262816 -0.6666313 0.099068 -0.1183309 0.0493771 -0.2335088 -0.6102765 0.1819579 0.1478542 0.2408968 -0.4924414 -0.0360947 0.1088914 -0.0515168 -0.5477446 1.2510258 0.132785 0.2109455 0.099256 1.5404508 -0.1927517 0.1660071 -0.1784462 0.2099798 0.0008195 0.0907499 -0.0189718 0.1069487 0.0420215 -0.0297954 -0.1417361 0.0328126 0.0469537 0.2729387 -0.2669761 -0.1432354 -0.3620974 0.2727753 0.0494591 0.1039983 0.0247887 0.3090196 0.2508179 0.1442823 -0.0750682 -0.3052286 0.2107937 0.038131 -0.054124 0.0140968 -0.0292808 0.0112879 -0.0156195 -0.0519896 -0.0543127 -0.5890621 0.0778112 0.0007893 0.0719635 0.0193786 -0.0850639 0.1710557 -0.0490706 0.3111893 -0.2224792 -0.0327014 -0.0302637 -0.0230118 -0.1183845 1.1821521 0.0665433 0.5849991 0.0543871 0.9470011 -0.3283869 0.7604951 -0.3280677 0.7606953 -0.1017463 -0.175815 0.0035804 0.1500754 0.1373353 -0.0443144 -0.0125447 -0.0472625 -0.082663 0.1097061 0.0093019 -0.0528122 -0.0097411 0.2106531 -0.0421157 -0.0820189 -0.0287311 -0.0874063 -0.0060768 -0.1721154 -0.044515 -0.2277773 -0.1635771 0.0551298 -0.0159604 0.0389759 -0.145341 0.0116179 -0.0402644 -0.0265878 -0.0326538 -0.0405484 -0.0769288 -0.0232988 -0.0304256 0.0711043 0.0158412 -0.011223 0.0623231 -0.0292452 0.0264324 0.1085128 0.0503631 0.0404867 0.014795 -0.0317836 0.070033 0.1142846 0.0463193 -0.0348539 -0.0419442 0.135407 -0.1002736 -0.1125712 0.0552926 -0.0635655 0.0667396 -0.0459516 0.0783573 0.0002416 0.0753187 -0.0007461 0.134745 0.0551795 -0.0127142 0.0413317 -0.0595137 0.0902492 0.0264585 0.0278372 0.0327259 0.1506319 0.2285924 0.0037232 -0.0942668 0.0744606 0.198604 -0.002087 -0.1730635 0.0496725 0.1655829 0.1846784 -0.1198875 -0.0116952 -0.1071067 0.1241845 -0.0014435 -0.0270485 0.0548193 0.3143059 0.0982208 0.0004308 0.0164812 0.0155685 -0.0948125 0.0251778 0.0153051 0.0277913 0.1437376 -0.034177 0.092589 0.046483 0.0787149 0.0338698 -0.0102313 0.0572517 -0.0078319 0.1454195 0.3268894 -0.0732546 -0.0285283 -0.1219591 0.1250573 0.0083964 0.0049458 0.0367957 0.367848 unknown
polarizability: 155.0713946|-6.3834615|150.0638732|0.4762938|-8.5957561|70.6979823 unknown
InChI: InChI=1S/C9H10N2O4/c10-7(9(12)13)5-6-3-1-2-4-8(6)11(14)15/h1-4,7,12H,5,10H2
charge 0 multiplicity 1
25 atoms
O  -3.779332 -0.145779 -1.396904
O  -2.725325 -1.671005 -0.007339
O  2.849549 2.240167 0.051146
O  0.601977 2.35247 -0.273715
N  -2.568537 1.880441 0.004733
N  1.685346 1.686969 -0.018755
C  -0.885673 0.335104 0.981656
C  -1.812068 0.637914 -0.23578
C  0.390307 -0.406318 0.613651
C  1.595477 0.219443 0.175677
C  0.432462 -1.819196 0.747474
C  -2.781124 -0.517783 -0.486228
C  2.779828 -0.508716 -0.095416
C  1.595855 -2.56372 0.460571
C  2.77793 -1.907657 0.040402
H  -0.655066 1.305093 1.44988
H  -1.451859 -0.262862 1.71546
H  -1.173792 0.690124 -1.152994
H  -0.481995 -2.32723 1.068869
H  3.67496 0.036299 -0.406728
H  -3.338976 2.020148 -0.657837
H  -1.941803 2.691633 0.054357
H  1.581786 -3.653502 0.568415
H  3.685148 -2.479457 -0.178485
H  -4.389475 -0.91618 -1.555109
