program: Gaussian 09
title: 000228814
version: EM64L-G09RevD.01
frameworkgroup: C1[X(C9H10N2O4)]
method: RPBEPBE
basis: SDD
operation: Freq
keyword: #p
keyword: freq=noraman
keyword: PBEPBE/SDD
title: #p freq=noraman PBEPBE/SDD
converged: YES YES NO NO
title: Mulliken charges:
elementType: O O O O N N C C C C C C C C C H H H H H H H H H H
charge: -0.428293 -0.221218 -0.210799 -0.199058 -0.619984 0.018579 -0.587102 -0.140277 0.512496 -0.501474 -0.404825 0.366116 0.218956 -0.193106 -0.373936 0.206328 0.261875 0.243633 0.318537 0.238528 0.237145 0.305275 0.279431 0.288534 0.384638
chargesum: 0.00000
title: Mulliken charges with hydrogens summed into heavy atoms:
elementType: O O O O N N C C C C C C C C C
charge: -0.043654 -0.221218 -0.210799 -0.199058 -0.035279 0.018579 -0.118900 0.103356 0.512496 -0.182936 -0.166297 0.366116 0.218956 0.044039 -0.085402
polarizability: 1.62639263e+02 1.24759496e+01 1.31006737e+02 -1.31372261e+01 1.23712529e+01 8.15655225e+01
1716.lowfreq: -9.5488 -2.2924 -0.0007 -0.0005 0.0001 3.2493 16.2208 32.1258 50.7587
frequency: 15.4269 32.0561 50.7555 60.6490 89.7005 165.2952 170.1172 215.4940 247.8371 265.0985 274.9230 330.8770 353.4236 387.4619 422.0884 447.0666 508.0976 530.6871 550.6485 567.0152 595.8970 634.9591 659.0363 690.1426 701.6493 710.7617 760.5627 784.4927 816.6083 889.3237 925.6045 944.8640 955.4327 989.8762 995.7121 999.0546 1046.9919 1083.0199 1091.8195 1106.2818 1162.3975 1175.5703 1206.1211 1210.3522 1227.8764 1259.6212 1282.6719 1298.1385 1330.6662 1371.8932 1381.9102 1399.4158 1435.5378 1459.1644 1479.0556 1589.4492 1616.2390 1628.8855 1675.8005 2868.3969 2997.2369 3080.8643 3122.8187 3156.0727 3184.2761 3187.8535 3471.9272 3514.6541 3605.5797
redmass: 6.4479 6.8121 11.2268 8.6657 4.5982 6.9954 5.5764 4.1519 1.2148 4.5334 3.8877 3.3328 2.6136 7.3400 3.2450 4.7380 5.1077 4.2799 3.8569 1.3070 4.4959 1.4082 6.9005 2.4975 4.3451 4.5536 7.0088 3.1172 1.5643 3.5512 1.6875 1.6664 1.5421 5.9816 1.7773 1.9893 2.3721 1.6031 2.0946 2.5880 1.1511 1.1256 1.8846 2.5255 3.5966 1.6350 1.3072 1.3118 1.4536 10.9069 2.1932 4.7230 2.6612 1.1162 2.7634 6.5358 6.9874 1.0970 9.2652 1.0801 1.0648 1.0978 1.0894 1.0931 1.0925 1.0961 1.0446 1.0641 1.0991
irintensity: 0.6057 1.2046 0.1245 0.8045 1.5449 4.2803 2.0947 1.0094 46.3313 2.9391 0.4924 19.8526 1.7221 1.5674 0.1061 13.4273 14.7393 33.3014 18.1904 78.3516 26.8388 261.3777 12.7448 31.3402 14.7326 32.1227 15.2847 3.4490 26.6793 3.4578 4.3289 2.1587 15.2688 0.3830 16.1838 32.2725 307.5768 25.9193 15.6150 26.7981 3.9504 7.0031 33.1890 100.3447 122.8729 18.5944 6.1655 0.3563 19.4821 112.8198 16.6205 0.9756 14.7886 17.4773 37.8377 3.3723 4.1916 48.1628 187.3846 70.5149 26.4238 5.7665 11.1154 13.3997 3.8069 5.9796 4.9238 28.3529 5.7537
temp: 298.150 k
press: 1.00000 atm
elementType: 8 8 8 8 7 7 6 6 6 6 6 6 6 6 6 1 1 1 1 1 1 1 1 1 1
symmnumber: 1
zpe: 487162.8 jmol-1
zpe.correction: 0.185551 hartree
zpe.thermalcorrener: 0.199761 hartree
zpe.thermalcorrenthalpy: 0.200705 hartree
zpe.thermalcorrgfe: 0.141934 hartree
zpe.sumelectzpe: -758.167593 hartree
zpe.sumelectthermal: -758.153382 hartree
zpe.sumelectthermalent: -758.152438 hartree
zpe.sumelectthermalfe: -758.211209 hartree
dipole: 5.3782 4.9964 1.5931
dipole: 7.5118
quadrupole: -92.5379 -81.8087 -86.7434
quadrupole: -8.3080 2.0474 -4.2735
quadrupole: -5.5079 5.2213 0.2866 -8.3080 2.0474 -4.2735
hfenergy: -758.3531432 hartree
pointgroup: C01 [X(C9H10N2O4)]
dipole: -2.0954063 1.944017 -0.7512006 debye
dipolederiv: -0.770414 -0.1734774 -0.3470039 -0.2794634 -0.336891 -0.2209846 -0.5274816 -0.2015183 -0.9020248 -0.6762505 -0.000512 -0.2653463 0.2388137 -0.6562689 0.1336683 -0.2959088 -0.0917206 -0.5222201 -0.895249 0.0568155 0.1438365 0.1116199 -0.4518297 0.0697465 0.1491149 0.0740101 -0.3021912 -0.4946503 0.0574846 0.044246 0.0562712 -0.7480577 0.2185927 0.0548093 0.2053206 -0.3243729 -0.7786579 -0.0708883 0.1354057 -0.0771163 -0.4416913 0.1781619 0.1064218 0.1367759 -0.5347489 1.3821222 -0.356183 -0.1654705 -0.4538103 1.2240244 -0.3365806 -0.16933 -0.3207817 0.3710119 -0.0812932 -0.0133923 0.0015589 -0.0336652 0.1063372 0.0164848 -0.1582497 -0.0078772 0.0615596 0.6223118 0.1141012 -0.1605332 -0.0200019 0.1092885 -0.1099375 0.0175441 -0.0791211 0.287663 0.4017628 0.1252684 -0.1013951 0.0715008 -0.1892209 0.0346522 -0.1503723 0.0041745 -0.0694334 -0.0651311 -0.2068958 0.0490405 0.0898029 0.0170406 -0.0337071 -0.0353594 0.0576058 -0.1001476 0.0215532 -0.0753026 -0.0281933 -0.0960576 0.0661849 -0.0470186 0.008973 -0.0498401 -0.1095099 -0.2236375 0.2852884 -0.0365446 0.3426775 -0.2471768 0.0347401 -0.0603013 0.0403663 0.054693 0.9406918 -0.0481137 0.6274611 -0.0543638 0.888015 0.1548916 0.8456037 0.3091557 0.9729923 -0.2333186 0.0909203 -0.0256873 0.1205784 0.1023709 -0.1078322 -0.0217099 -0.1140074 -0.0872411 -0.0473949 0.0315579 -0.0464792 -0.252076 0.0179383 -0.0022315 0.0810515 -0.063122 -0.1036494 -0.0206732 0.0365964 0.0490928 0.0697106 -0.0928881 -0.100625 0.0375827 -0.0414594 0.0511183 0.035304 0.0034752 -0.0110861 -0.0114797 0.0298078 0.1119774 0.0227596 0.0550356 0.0170357 -0.066262 -0.0228919 0.09379 -0.0868729 -0.0306433 0.0905547 0.1371349 0.0538771 -0.1376916 0.1745437 -0.0015666 0.0333027 -0.0234407 0.0897744 0.0306386 0.0466751 0.0232089 0.1490159 -0.004958 0.1205168 0.0032167 0.1103082 0.0148345 0.0225596 0.0049652 0.0151042 0.1272767 0.0636373 -0.0357903 0.0327655 -0.0349837 -0.0572191 0.0823398 0.0388317 0.0865686 0.1148398 0.1276443 -0.0052251 -0.0480715 0.0923335 0.2970636 -0.0649191 -0.1270366 -0.0786895 0.1547548 0.2042878 0.0091494 -0.0023185 0.0430495 0.0314777 -0.1339786 -0.0230933 -0.0502317 0.314085 0.0420764 -0.0254163 0.0433509 0.0028591 0.1387312 0.0107547 0.0327467 0.0236248 0.1589229 0.3419548 0.1044812 -0.0189377 0.0738063 0.1189977 -0.0319482 -0.0153711 0.0135408 0.3582618 unknown
polarizability: 164.7747259|-10.4559308|131.286616|-5.9452203|-12.0169914|79.1501808 unknown
InChI: InChI=1S/C9H10N2O4/c10-8(9(12)13)5-6-2-1-3-7(4-6)11(14)15/h1-4,8,12H,5,10H2
charge 0 multiplicity 1
25 atoms
O  -3.315679 -1.367384 -1.696278
O  -1.692371 -1.941164 -0.139476
O  4.266517 -0.722236 -0.079127
O  2.700459 -2.045507 0.916845
N  -4.026749 0.526809 0.257203
N  3.070894 -0.943028 0.35895
C  -1.656991 0.730547 0.970838
C  -2.627788 0.376479 -0.188603
C  -0.21839 0.936983 0.518346
C  0.743242 -0.092982 0.645256
C  0.183949 2.176994 -0.047049
C  2.064645 0.142407 0.211598
C  -2.454145 -1.083162 -0.62618
C  1.512111 2.390912 -0.48152
C  2.473736 1.368458 -0.355664
H  -2.031516 1.665534 1.431611
H  -1.726176 -0.063893 1.732545
H  -2.368255 1.007983 -1.074477
H  0.471984 -1.068114 1.057678
H  -0.549812 2.987817 -0.137456
H  1.799247 3.355989 -0.911396
H  -4.721144 0.223411 -0.431458
H  -4.237292 1.437069 0.675174
H  3.510496 1.498117 -0.67593
H  -3.221871 -2.323939 -1.956228
